BDBM50053348 CHEMBL3330276
SMILES: NS(=O)(=O)c1cccc(c1)-c1n[nH]c2ccc(cc12)C(=O)NC1(CCNCC1)c1ccccc1
InChI Key: InChIKey=PFQVMIVCDHYEQG-UHFFFAOYSA-N
Data: 1 IC50
Activity Spreadsheet -- Enzyme Inhibition Constant Data from BindingDB
Found 1 hit for monomerid = 50053348
Trg + Lig
Ki
nM
ΔG°
kcal/mole
IC50
nM
Kd
nM
EC50/IC50
nM
koff
s-1
kon
M-1s-1
pHTemp
°C
Dual specificity protein kinase TTK
(Homo sapiens (Human))
BDBM50053348
(CHEMBL3330276)
Show SMILES NS(=O)(=O)c1cccc(c1)-c1n[nH]c2ccc(cc12)C(=O)NC1(CCNCC1)c1ccccc1
Show InChI InChI=1S/C25H25N5O3S/c26-34(32,33)20-8-4-5-17(15-20)23-21-16-18(9-10-22(21)29-30-23)24(31)28-25(11-13-27-14-12-25)19-6-2-1-3-7-19/h1-10,15-16,27H,11-14H2,(H,28,31)(H,29,30)(H2,26,32,33)
n/an/a 58n/an/an/an/an/an/a
University Health Network
Curated by ChEMBL
Assay Description
Inhibition of SUMO-tagged human TTK (1-275 residues) compound pre-incubated for 15 mins prior ATP addition by MBP-based assay
Bioorg Med Chem 22: 4968-97 (2014)
Article DOI: 10.1016/j.bmc.2014.06.027
BindingDB Entry DOI: 10.7270/Q2K35WB2