BDBM50053374 CHEMBL3330407
SMILES: NS(=O)(=O)c1cccc(c1)-c1n[nH]c2ccc(NC(=O)C(N3CCCC3)c3ccccc3)cc12
InChI Key:
Data: 1 IC50
Activity Spreadsheet -- Enzyme Inhibition Constant Data from BindingDB
Found 1 hit for monomerid = 50053374
Trg + Lig
Ki
nM
ΔG°
kcal/mole
IC50
nM
Kd
nM
EC50/IC50
nM
koff
s-1
kon
M-1s-1
pHTemp
°C
Dual specificity protein kinase TTK
(Homo sapiens (Human))
BDBM50053374
(CHEMBL3330407)
Show SMILES NS(=O)(=O)c1cccc(c1)-c1n[nH]c2ccc(NC(=O)C(N3CCCC3)c3ccccc3)cc12
n/an/a 8.90n/an/an/an/an/an/a
University Health Network
Curated by ChEMBL
Assay Description
Inhibition of SUMO-tagged human TTK (1-275 residues) compound pre-incubated for 15 mins prior ATP addition by MBP-based assay
Bioorg Med Chem 22: 4968-97 (2014)
Article DOI: 10.1016/j.bmc.2014.06.027
BindingDB Entry DOI: 10.7270/Q2K35WB2