BDBM50053408 HALOPERIDOL DECANOATE::Haldol::Haldol Dec::Haloperidol Decanoate::R-13672
SMILES: CCCCCCCCCC(=O)OC1(CCN(CCCC(=O)c2ccc(F)cc2)CC1)c1ccc(Cl)cc1
InChI Key: InChIKey=GUTXTARXLVFHDK-UHFFFAOYSA-N
Data: 5 KI  1 EC50
Activity Spreadsheet -- Enzyme Inhibition Constant Data from BindingDB
Found 6 hits for monomerid = 50053408
Trg + Lig
Ki
nM
ΔG°
kcal/mole
IC50
nM
Kd
nM
EC50/IC50
nM
koff
s-1
kon
M-1s-1
pHTemp
°C
D(2) dopamine receptor
(Homo sapiens (Human))
BDBM50053408
(HALOPERIDOL DECANOATE | Haldol | Haldol Dec | Halo...)
Show SMILES CCCCCCCCCC(=O)OC1(CCN(CCCC(=O)c2ccc(F)cc2)CC1)c1ccc(Cl)cc1
Show InChI InChI=1S/C31H41ClFNO3/c1-2-3-4-5-6-7-8-11-30(36)37-31(26-14-16-27(32)17-15-26)20-23-34(24-21-31)22-9-10-29(35)25-12-18-28(33)19-13-25/h12-19H,2-11,20-24H2,1H3
Reactome pathway
0.460n/an/an/an/an/an/an/an/a
Friedrich-Alexander University
Curated by ChEMBL
Assay Description
Displacement of [3H]spiperone from human D2short receptor stably expressed in CHO cell membranes by competitive binding assay
Bioorg Med Chem Lett 24: 3753-6 (2014)
Article DOI: 10.1016/j.bmcl.2014.06.079
BindingDB Entry DOI: 10.7270/Q2FF3V0M
D(2) dopamine receptor
(Homo sapiens (Human))
BDBM50053408
(HALOPERIDOL DECANOATE | Haldol | Haldol Dec | Halo...)
Show SMILES CCCCCCCCCC(=O)OC1(CCN(CCCC(=O)c2ccc(F)cc2)CC1)c1ccc(Cl)cc1
Show InChI InChI=1S/C31H41ClFNO3/c1-2-3-4-5-6-7-8-11-30(36)37-31(26-14-16-27(32)17-15-26)20-23-34(24-21-31)22-9-10-29(35)25-12-18-28(33)19-13-25/h12-19H,2-11,20-24H2,1H3
Reactome pathway
1.80n/an/an/an/an/an/an/an/a
Friedrich-Alexander University
Curated by ChEMBL
Assay Description
Displacement of [3H]spiperone from human D2long receptor stably expressed in CHO cell membranes by competitive binding assay
Bioorg Med Chem Lett 24: 3753-6 (2014)
Article DOI: 10.1016/j.bmcl.2014.06.079
BindingDB Entry DOI: 10.7270/Q2FF3V0M
D(3) dopamine receptor
(Homo sapiens (Human))
BDBM50053408
(HALOPERIDOL DECANOATE | Haldol | Haldol Dec | Halo...)
Show SMILES CCCCCCCCCC(=O)OC1(CCN(CCCC(=O)c2ccc(F)cc2)CC1)c1ccc(Cl)cc1
Show InChI InChI=1S/C31H41ClFNO3/c1-2-3-4-5-6-7-8-11-30(36)37-31(26-14-16-27(32)17-15-26)20-23-34(24-21-31)22-9-10-29(35)25-12-18-28(33)19-13-25/h12-19H,2-11,20-24H2,1H3
3.5n/an/an/an/an/an/an/an/a
Friedrich-Alexander University
Curated by ChEMBL
Assay Description
Displacement of [3H]spiperone from human D3 receptor stably expressed in CHO cell membranes by competitive binding assay
Bioorg Med Chem Lett 24: 3753-6 (2014)
Article DOI: 10.1016/j.bmcl.2014.06.079
BindingDB Entry DOI: 10.7270/Q2FF3V0M
D(4) dopamine receptor
(Homo sapiens (Human))
BDBM50053408
(HALOPERIDOL DECANOATE | Haldol | Haldol Dec | Halo...)
Show SMILES CCCCCCCCCC(=O)OC1(CCN(CCCC(=O)c2ccc(F)cc2)CC1)c1ccc(Cl)cc1
Show InChI InChI=1S/C31H41ClFNO3/c1-2-3-4-5-6-7-8-11-30(36)37-31(26-14-16-27(32)17-15-26)20-23-34(24-21-31)22-9-10-29(35)25-12-18-28(33)19-13-25/h12-19H,2-11,20-24H2,1H3
Reactome pathway
5.80n/an/an/an/an/an/an/an/a
Friedrich-Alexander University
Curated by ChEMBL
Assay Description
Displacement of [3H]spiperone from human D4.4 receptor stably expressed in CHO cell membranes by competitive binding assay
Bioorg Med Chem Lett 24: 3753-6 (2014)
Article DOI: 10.1016/j.bmcl.2014.06.079
BindingDB Entry DOI: 10.7270/Q2FF3V0M
Dopamine D1 receptor
(Sus scrofa)
BDBM50053408
(HALOPERIDOL DECANOATE | Haldol | Haldol Dec | Halo...)
Show SMILES CCCCCCCCCC(=O)OC1(CCN(CCCC(=O)c2ccc(F)cc2)CC1)c1ccc(Cl)cc1
Show InChI InChI=1S/C31H41ClFNO3/c1-2-3-4-5-6-7-8-11-30(36)37-31(26-14-16-27(32)17-15-26)20-23-34(24-21-31)22-9-10-29(35)25-12-18-28(33)19-13-25/h12-19H,2-11,20-24H2,1H3
140n/an/an/an/an/an/an/an/a
Friedrich-Alexander University
Curated by ChEMBL
Assay Description
Displacement of [3H]SCH23390 from porcine striatal membranes D1 receptor by competitive binding assay
Bioorg Med Chem Lett 24: 3753-6 (2014)
Article DOI: 10.1016/j.bmcl.2014.06.079
BindingDB Entry DOI: 10.7270/Q2FF3V0M
Twik-RElated Potassium (K+) channel 1 (TREK1)
(Homo sapiens (Human))
BDBM50053408
(HALOPERIDOL DECANOATE | Haldol | Haldol Dec | Halo...)
Show SMILES CCCCCCCCCC(=O)OC1(CCN(CCCC(=O)c2ccc(F)cc2)CC1)c1ccc(Cl)cc1
Show InChI InChI=1S/C31H41ClFNO3/c1-2-3-4-5-6-7-8-11-30(36)37-31(26-14-16-27(32)17-15-26)20-23-34(24-21-31)22-9-10-29(35)25-12-18-28(33)19-13-25/h12-19H,2-11,20-24H2,1H3
n/an/an/an/a 5.50E+3n/an/a7.322
Korea Institute of Science and Technology
Assay Description
The hTREK1 stable cell lines were seeded at a density of 10 000 cells/well in a 12-well plate. Whole-cell membrane currents were amplified using the ...
Chem Biol Drug Des 88: 807-819 (2016)
Article DOI: 10.1111/cbdd.12810
BindingDB Entry DOI: 10.7270/Q2S181B1