BDBM50053683 CHEMBL3318854::US9328106, 135
SMILES: Cn1ncc(NC(=O)c2nc(sc2N)-c2c(F)cccc2F)c1[C@@H]1C[C@@H](F)[C@H](N)CCO1
InChI Key: InChIKey=ZNKBCQQYCPIUSJ-BZPMIXESSA-N
Data: 2 KI
Activity Spreadsheet -- Enzyme Inhibition Constant Data from BindingDB
Found 2 hits for monomerid = 50053683
Trg + Lig
Ki
nM
ΔG°
kcal/mole
IC50
nM
Kd
nM
EC50/IC50
nM
koff
s-1
kon
M-1s-1
pHTemp
°C
Serine/threonine-protein kinase pim-1
(Homo sapiens (Human))
BDBM50053683
(CHEMBL3318854 | US9328106, 135)
Show SMILES Cn1ncc(NC(=O)c2nc(sc2N)-c2c(F)cccc2F)c1[C@@H]1C[C@@H](F)[C@H](N)CCO1 |r|
Show InChI InChI=1S/C20H21F3N6O2S/c1-29-17(14-7-11(23)12(24)5-6-31-14)13(8-26-29)27-19(30)16-18(25)32-20(28-16)15-9(21)3-2-4-10(15)22/h2-4,8,11-12,14H,5-7,24-25H2,1H3,(H,27,30)/t11-,12-,14+/m1/s1
0.0100n/an/an/an/an/an/an/an/a
Therachem Research Medilab (India) Pvt. Ltd.
Curated by ChEMBL
Assay Description
Inhibition of PIM1 (unknown origin)
ACS Med Chem Lett 5: 730-1 (2014)
Article DOI: 10.1021/ml5001678
BindingDB Entry DOI: 10.7270/Q2SN0BMH
Serine/threonine-protein kinase pim-1
(Homo sapiens (Human))
BDBM50053683
(CHEMBL3318854 | US9328106, 135)
Show SMILES Cn1ncc(NC(=O)c2nc(sc2N)-c2c(F)cccc2F)c1[C@@H]1C[C@@H](F)[C@H](N)CCO1 |r|
Show InChI InChI=1S/C20H21F3N6O2S/c1-29-17(14-7-11(23)12(24)5-6-31-14)13(8-26-29)27-19(30)16-18(25)32-20(28-16)15-9(21)3-2-4-10(15)22/h2-4,8,11-12,14H,5-7,24-25H2,1H3,(H,27,30)/t11-,12-,14+/m1/s1
US Patent
0.0100 -15.0n/an/an/an/an/a7.225
GENENTECH, INC.
US Patent
Assay Description
LC3K assay: PIM-1, -2, and -3 enzymes were generated as fusion proteins expressed in bacteria and purified by IMAC column chromatography (Sun, X., Ch...
US Patent US9328106 (2016)
BindingDB Entry DOI: 10.7270/Q29W0DBT