null
SMILES: C[C@H]1O[C@H](C[C@@H](N)[C@]1(C)O)c1c(NC(=O)c2csc(n2)-c2c(F)cccc2F)cnn1C
InChI Key: InChIKey=XWKYJYQWDZMVLP-QHCIZFMYSA-N
Activity Spreadsheet -- Enzyme Inhibition Constant Data from BindingDB
Found 2 hits for monomerid = 50053685
Trg + Lig
Ki
nM
ΔG°
kcal/mole
IC50
nM
Kd
nM
EC50/IC50
nM
koff
s-1
kon
M-1s-1
pHTemp
°C
Serine/threonine-protein kinase pim-1
(Homo sapiens (Human))
BDBM50053685
(CHEMBL3318855 | US9328106, 341)
Show SMILES C[C@H]1O[C@H](C[C@@H](N)[C@]1(C)O)c1c(NC(=O)c2csc(n2)-c2c(F)cccc2F)cnn1C |r|
Show InChI InChI=1S/C21H23F2N5O3S/c1-10-21(2,30)16(24)7-15(31-10)18-13(8-25-28(18)3)26-19(29)14-9-32-20(27-14)17-11(22)5-4-6-12(17)23/h4-6,8-10,15-16,30H,7,24H2,1-3H3,(H,26,29)/t10-,15-,16-,21-/m1/s1
0.00300n/an/an/an/an/an/an/an/a
Therachem Research Medilab (India) Pvt. Ltd.
Curated by ChEMBL
Assay Description
Inhibition of PIM1 (unknown origin)
ACS Med Chem Lett 5: 730-1 (2014)
Article DOI: 10.1021/ml5001678
BindingDB Entry DOI: 10.7270/Q2SN0BMH
Serine/threonine-protein kinase pim-1
(Homo sapiens (Human))
BDBM50053685
(CHEMBL3318855 | US9328106, 341)
Show SMILES C[C@H]1O[C@H](C[C@@H](N)[C@]1(C)O)c1c(NC(=O)c2csc(n2)-c2c(F)cccc2F)cnn1C |r|
Show InChI InChI=1S/C21H23F2N5O3S/c1-10-21(2,30)16(24)7-15(31-10)18-13(8-25-28(18)3)26-19(29)14-9-32-20(27-14)17-11(22)5-4-6-12(17)23/h4-6,8-10,15-16,30H,7,24H2,1-3H3,(H,26,29)/t10-,15-,16-,21-/m1/s1
US Patent
0.00300 -15.7n/an/an/an/an/a7.225
GENENTECH, INC.
US Patent
Assay Description
LC3K assay: PIM-1, -2, and -3 enzymes were generated as fusion proteins expressed in bacteria and purified by IMAC column chromatography (Sun, X., Ch...
US Patent US9328106 (2016)
BindingDB Entry DOI: 10.7270/Q29W0DBT