BDBM50053764 CHEMBL3356449
SMILES: O=C1CN2C(COc3ccc(NC4CCNCC4)cc23)=NN1
InChI Key: InChIKey=QJZXNTGQYLVSGK-UHFFFAOYSA-N
Data: 1 IC50
Activity Spreadsheet -- Enzyme Inhibition Constant Data from BindingDB
Found 1 hit for monomerid = 50053764
Trg + Lig
Ki
nM
ΔG°
kcal/mole
IC50
nM
Kd
nM
EC50/IC50
nM
koff
s-1
kon
M-1s-1
pHTemp
°C
Protein kinase C theta type
(Homo sapiens (Human))
BDBM50053764
(CHEMBL3356449)
Show SMILES O=C1CN2C(COc3ccc(NC4CCNCC4)cc23)=NN1 |c:22|
Show InChI InChI=1S/C15H19N5O2/c21-15-8-20-12-7-11(17-10-3-5-16-6-4-10)1-2-13(12)22-9-14(20)18-19-15/h1-2,7,10,16-17H,3-6,8-9H2,(H,19,21)
NCI pathway
Reactome pathway
n/an/a 2.10E+4n/an/an/an/an/an/a
AbbVie Bioresearch Center
Curated by ChEMBL
Assay Description
Inhibition of human recombinant PKCtheta expressed in Sf21 cells using Bio-cdc peptide substrate and ATP after 60 mins by time-resolved fluorescence ...
J Med Chem 58: 222-36 (2015)
Article DOI: 10.1021/jm500669m
BindingDB Entry DOI: 10.7270/Q22F7Q2Z