BDBM50053790 CHEMBL3356453
SMILES: O=C1CN2C(COc3ccc(NCC4CCNCC4)cc23)=NN1
InChI Key: InChIKey=UCGLXXXJSFDVLH-UHFFFAOYSA-N
Data: 1 IC50
Activity Spreadsheet -- Enzyme Inhibition Constant Data from BindingDB
Found 1 hit for monomerid = 50053790
Trg + Lig
Ki
nM
ΔG°
kcal/mole
IC50
nM
Kd
nM
EC50/IC50
nM
koff
s-1
kon
M-1s-1
pHTemp
°C
Protein kinase C theta type
(Homo sapiens (Human))
BDBM50053790
(CHEMBL3356453)
Show SMILES O=C1CN2C(COc3ccc(NCC4CCNCC4)cc23)=NN1 |c:23|
Show InChI InChI=1S/C16H21N5O2/c22-16-9-21-13-7-12(18-8-11-3-5-17-6-4-11)1-2-14(13)23-10-15(21)19-20-16/h1-2,7,11,17-18H,3-6,8-10H2,(H,20,22)
NCI pathway
Reactome pathway
n/an/a 3.10E+4n/an/an/an/an/an/a
AbbVie Bioresearch Center
Curated by ChEMBL
Assay Description
Inhibition of human recombinant PKCtheta expressed in Sf21 cells using Bio-cdc peptide substrate and ATP after 60 mins by time-resolved fluorescence ...
J Med Chem 58: 222-36 (2015)
Article DOI: 10.1021/jm500669m
BindingDB Entry DOI: 10.7270/Q22F7Q2Z