BDBM50053987 (S)-N-(2,2-Dimethyl-propyl)-3-((S)-2-{(S)-2-[3-(1-ethyl-propyl)-ureido]-3,3-dimethyl-butyrylamino}-4-oxo-4-pyrrolidin-1-yl-butyrylamino)-succinamic acid::CHEMBL132130
SMILES: CCC(CC)NC(=O)N[C@H](C(=O)N[C@@H](CC(=O)N1CCCC1)C(=O)N[C@@H](CC(O)=O)C(=O)NCC(C)(C)C)C(C)(C)C
InChI Key: InChIKey=KPGBASAKRFATDZ-SXWKCWPCSA-N
Data: 1 IC50
Activity Spreadsheet -- Enzyme Inhibition Constant Data from BindingDB
Found 1 hit for monomerid = 50053987
Trg + Lig
Ki
nM
ΔG°
kcal/mole
IC50
nM
Kd
nM
EC50/IC50
nM
koff
s-1
kon
M-1s-1
pHTemp
°C
RRM1/RRM2 holoenzyme
(Homo sapiens (Human))
BDBM50053987
((S)-N-(2,2-Dimethyl-propyl)-3-((S)-2-{(S)-2-[3-(1-...)
Show SMILES CCC(CC)NC(=O)N[C@H](C(=O)N[C@@H](CC(=O)N1CCCC1)C(=O)N[C@@H](CC(O)=O)C(=O)NCC(C)(C)C)C(C)(C)C
Show InChI InChI=1S/C29H52N6O7/c1-9-18(10-2)31-27(42)34-23(29(6,7)8)26(41)33-19(15-21(36)35-13-11-12-14-35)25(40)32-20(16-22(37)38)24(39)30-17-28(3,4)5/h18-20,23H,9-17H2,1-8H3,(H,30,39)(H,32,40)(H,33,41)(H,37,38)(H2,31,34,42)/t19-,20-,23+/m0/s1
Reactome pathway
n/an/a 40n/an/an/an/an/an/a
Bio-M£ga/Boehringer Ingelheim Research Inc.
Curated by ChEMBL
Assay Description
Inhibitory effect was evaluated on Herpes simplex virus (HSV) ribonucleotide reductase (RR) enzyme.
J Med Chem 39: 4173-80 (1996)
Article DOI: 10.1021/jm960324r
BindingDB Entry DOI: 10.7270/Q28W3DZQ