BDBM50054057 CHEMBL3319544
SMILES: Nc1ccc(cn1)S(=O)(=O)N1CCN(CC1)c1ncc(cc1-c1ccccc1O)C(O)(C(F)(F)F)C(F)(F)F
InChI Key: InChIKey=OGOGMCHKKXEGPD-UHFFFAOYSA-N
Data: 1 IC50  1 EC50
Activity Spreadsheet -- Enzyme Inhibition Constant Data from BindingDB
Found 2 hits for monomerid = 50054057
Trg + Lig
Ki
nM
ΔG°
kcal/mole
IC50
nM
Kd
nM
EC50/IC50
nM
koff
s-1
kon
M-1s-1
pHTemp
°C
Hexokinase-4
(Mus musculus (Mouse))
BDBM50054057
(CHEMBL3319544)
Show SMILES Nc1ccc(cn1)S(=O)(=O)N1CCN(CC1)c1ncc(cc1-c1ccccc1O)C(O)(C(F)(F)F)C(F)(F)F
Show InChI InChI=1S/C23H21F6N5O4S/c24-22(25,26)21(36,23(27,28)29)14-11-17(16-3-1-2-4-18(16)35)20(32-12-14)33-7-9-34(10-8-33)39(37,38)15-5-6-19(30)31-13-15/h1-6,11-13,35-36H,7-10H2,(H2,30,31)
n/an/an/an/a 565n/an/an/an/a
Amgen, Inc.
Curated by ChEMBL
Assay Description
Induction of GK translocation from nucleus to cytoplasm of mouse hepatocytes preincubated for 20 mins followed by glucose challenge measured after 40...
J Med Chem 57: 5949-64 (2014)
Article DOI: 10.1021/jm5001979
BindingDB Entry DOI: 10.7270/Q2J67JJ3
Hexokinase-4
(Homo sapiens (Human))
BDBM50054057
(CHEMBL3319544)
Show SMILES Nc1ccc(cn1)S(=O)(=O)N1CCN(CC1)c1ncc(cc1-c1ccccc1O)C(O)(C(F)(F)F)C(F)(F)F
Show InChI InChI=1S/C23H21F6N5O4S/c24-22(25,26)21(36,23(27,28)29)14-11-17(16-3-1-2-4-18(16)35)20(32-12-14)33-7-9-34(10-8-33)39(37,38)15-5-6-19(30)31-13-15/h1-6,11-13,35-36H,7-10H2,(H2,30,31)
NCI pathway
Reactome pathway
n/an/a 6n/an/an/an/an/an/a
Amgen, Inc.
Curated by ChEMBL
Assay Description
Inhibition of fluorescein-labeled human GK interaction with biotin-labeled human GKRP compound incubated for 20 mins prior to addition of fluorescein...
J Med Chem 57: 5949-64 (2014)
Article DOI: 10.1021/jm5001979
BindingDB Entry DOI: 10.7270/Q2J67JJ3