null
SMILES: CC(=O)N\N=C(\c1ccccc1O)c1cc(Br)ccc1O
InChI Key: InChIKey=DMQSEOCYTDGKGA-SDXDJHTJSA-N
Activity Spreadsheet -- Enzyme Inhibition Constant Data from BindingDB
Found 2 hits for monomerid = 50054205
Trg + Lig
Ki
nM
ΔG°
kcal/mole
IC50
nM
Kd
nM
EC50/IC50
nM
koff
s-1
kon
M-1s-1
pHTemp
°C
Glutathione S-transferase A1
(Homo sapiens (Human))
BDBM50054205
(CHEMBL3310889)
Show SMILES CC(=O)N\N=C(\c1ccccc1O)c1cc(Br)ccc1O
Show InChI InChI=1S/C15H13BrN2O3/c1-9(19)17-18-15(11-4-2-3-5-13(11)20)12-8-10(16)6-7-14(12)21/h2-8,20-21H,1H3,(H,17,19)/b18-15-
1.75E+3n/an/an/an/an/an/an/an/a
Agricultural University of Athens
Curated by ChEMBL
Assay Description
Competitive inhibition of human GSTA1 activity by double reciprocal Lineweaver-Burk graph
Bioorg Med Chem 22: 3957-70 (2014)
Article DOI: 10.1016/j.bmc.2014.06.007
BindingDB Entry DOI: 10.7270/Q28P625B
Glutathione S-transferase A1
(Homo sapiens (Human))
BDBM50054205
(CHEMBL3310889)
Show SMILES CC(=O)N\N=C(\c1ccccc1O)c1cc(Br)ccc1O
Show InChI InChI=1S/C15H13BrN2O3/c1-9(19)17-18-15(11-4-2-3-5-13(11)20)12-8-10(16)6-7-14(12)21/h2-8,20-21H,1H3,(H,17,19)/b18-15-
n/an/a 180n/an/an/an/an/an/a
Agricultural University of Athens
Curated by ChEMBL
Assay Description
Inhibition of human GSTA1 activity assessed as conjugation between CDNB and GSH
Bioorg Med Chem 22: 3957-70 (2014)
Article DOI: 10.1016/j.bmc.2014.06.007
BindingDB Entry DOI: 10.7270/Q28P625B