BDBM50054532 CHEMBL3323174
SMILES: COc1ccc2C(CN(C)Cc2c1)c1ccc2sccc2c1
InChI Key: InChIKey=DELHGKQNJWIBFE-UHFFFAOYSA-N
Data: 4 IC50
Activity Spreadsheet -- Enzyme Inhibition Constant Data from BindingDB
Found 4 hits for monomerid = 50054532
Trg + Lig
Ki
nM
ΔG°
kcal/mole
IC50
nM
Kd
nM
EC50/IC50
nM
koff
s-1
kon
M-1s-1
pHTemp
°C
Sodium-dependent noradrenaline transporter
(Homo sapiens (Human))
BDBM50054532
(CHEMBL3323174)
Show SMILES COc1ccc2C(CN(C)Cc2c1)c1ccc2sccc2c1
Show InChI InChI=1S/C19H19NOS/c1-20-11-15-10-16(21-2)4-5-17(15)18(12-20)13-3-6-19-14(9-13)7-8-22-19/h3-10,18H,11-12H2,1-2H3
Reactome pathway
n/an/a 5n/an/an/an/an/an/a
AMRI
Curated by ChEMBL
Assay Description
Displacement of [3H]Nisoxetine from human NET expressed in HEK293E cells after 1 hr by liquid scintillation counting
ACS Med Chem Lett 5: 760-5 (2014)
Article DOI: 10.1021/ml500053b
BindingDB Entry DOI: 10.7270/Q2154JPR
Cytochrome P450 2D6
(Homo sapiens (Human))
BDBM50054532
(CHEMBL3323174)
Show SMILES COc1ccc2C(CN(C)Cc2c1)c1ccc2sccc2c1
Show InChI InChI=1S/C19H19NOS/c1-20-11-15-10-16(21-2)4-5-17(15)18(12-20)13-3-6-19-14(9-13)7-8-22-19/h3-10,18H,11-12H2,1-2H3
n/an/a<1.00E+3n/an/an/an/an/an/a
AMRI
Curated by ChEMBL
Assay Description
Inhibition of CYP2D6 (unknown origin)
ACS Med Chem Lett 5: 760-5 (2014)
Article DOI: 10.1021/ml500053b
BindingDB Entry DOI: 10.7270/Q2154JPR
Sodium-dependent serotonin transporter
(Homo sapiens (Human))
BDBM50054532
(CHEMBL3323174)
Show SMILES COc1ccc2C(CN(C)Cc2c1)c1ccc2sccc2c1
Show InChI InChI=1S/C19H19NOS/c1-20-11-15-10-16(21-2)4-5-17(15)18(12-20)13-3-6-19-14(9-13)7-8-22-19/h3-10,18H,11-12H2,1-2H3
n/an/a 5.30n/an/an/an/an/an/a
AMRI
Curated by ChEMBL
Assay Description
Displacement of [3H]Citolapram from human SERT expressed in HEK293E cells after 1 hr by liquid scintillation counting
ACS Med Chem Lett 5: 760-5 (2014)
Article DOI: 10.1021/ml500053b
BindingDB Entry DOI: 10.7270/Q2154JPR
Sodium-dependent dopamine transporter
(Homo sapiens (Human))
BDBM50054532
(CHEMBL3323174)
Show SMILES COc1ccc2C(CN(C)Cc2c1)c1ccc2sccc2c1
Show InChI InChI=1S/C19H19NOS/c1-20-11-15-10-16(21-2)4-5-17(15)18(12-20)13-3-6-19-14(9-13)7-8-22-19/h3-10,18H,11-12H2,1-2H3
NCI pathway
Reactome pathway
n/an/a 9n/an/an/an/an/an/a
AMRI
Curated by ChEMBL
Assay Description
Displacement of [3H]WIN 35,428 from human DAT expressed in HEK293E cells after 1 hr by liquid scintillation counting
ACS Med Chem Lett 5: 760-5 (2014)
Article DOI: 10.1021/ml500053b
BindingDB Entry DOI: 10.7270/Q2154JPR