BDBM50054541 (Z)-2-Cyano-3-cyclopropyl-3-hydroxy-N-(3-methyl-4-pentafluoroethyl-phenyl)-acrylamide::CHEMBL139937
SMILES: Cc1cc(NC(=O)C(C#N)C(=O)C2CC2)ccc1C(F)(F)C(F)(F)F
InChI Key: InChIKey=YBFIOYANCKDTED-UHFFFAOYSA-N
Data: 2 IC50
Activity Spreadsheet -- Enzyme Inhibition Constant Data from BindingDB
Found 2 hits for monomerid = 50054541
Trg + Lig
Ki
nM
ΔG°
kcal/mole
IC50
nM
Kd
nM
EC50/IC50
nM
koff
s-1
kon
M-1s-1
pHTemp
°C
Dihydroorotate dehydrogenase
(Mus musculus)
BDBM50054541
((Z)-2-Cyano-3-cyclopropyl-3-hydroxy-N-(3-methyl-4-...)
Show SMILES Cc1cc(NC(=O)C(C#N)C(=O)C2CC2)ccc1C(F)(F)C(F)(F)F
Show InChI InChI=1S/C16H13F5N2O2/c1-8-6-10(4-5-12(8)15(17,18)16(19,20)21)23-14(25)11(7-22)13(24)9-2-3-9/h4-6,9,11H,2-3H2,1H3,(H,23,25)
Reactome pathway
n/an/a 282n/an/an/an/an/an/a
Hoechst Marion Roussel
Curated by ChEMBL
Assay Description
Inhibitory concentration tested on enzyme dihydroorotate dehydrogenase in mouse
J Med Chem 39: 4608-21 (1996)
Article DOI: 10.1021/jm9604437
BindingDB Entry DOI: 10.7270/Q20G3KSX
Dihydroorotate Dehydrogenase (DHODH)
(Rattus norvegicus (rat))
BDBM50054541
((Z)-2-Cyano-3-cyclopropyl-3-hydroxy-N-(3-methyl-4-...)
Show SMILES Cc1cc(NC(=O)C(C#N)C(=O)C2CC2)ccc1C(F)(F)C(F)(F)F
Show InChI InChI=1S/C16H13F5N2O2/c1-8-6-10(4-5-12(8)15(17,18)16(19,20)21)23-14(25)11(7-22)13(24)9-2-3-9/h4-6,9,11H,2-3H2,1H3,(H,23,25)
Reactome pathway
n/an/a 11n/an/an/an/an/an/a
Hoechst Marion Roussel
Curated by ChEMBL
Assay Description
Inhibitory concentration tested against enzyme dihydroorotate dehydrogenase in rat
J Med Chem 39: 4608-21 (1996)
Article DOI: 10.1021/jm9604437
BindingDB Entry DOI: 10.7270/Q20G3KSX