BDBM50054581 (Z)-2-Cyano-3-cyclopropyl-3-hydroxy-N-(4-trifluoromethanesulfinyl-phenyl)-acrylamide::CHEMBL358621
SMILES: FC(F)(F)S(=O)c1ccc(NC(=O)C(C#N)C(=O)C2CC2)cc1
InChI Key: InChIKey=HWZMCOGRZDFBES-UHFFFAOYSA-N
Data: 2 IC50
Activity Spreadsheet -- Enzyme Inhibition Constant Data from BindingDB
Found 2 hits for monomerid = 50054581
Trg + Lig
Ki
nM
ΔG°
kcal/mole
IC50
nM
Kd
nM
EC50/IC50
nM
koff
s-1
kon
M-1s-1
pHTemp
°C
Dihydroorotate Dehydrogenase (DHODH)
(Rattus norvegicus (rat))
BDBM50054581
((Z)-2-Cyano-3-cyclopropyl-3-hydroxy-N-(4-trifluoro...)
Show SMILES FC(F)(F)S(=O)c1ccc(NC(=O)C(C#N)C(=O)C2CC2)cc1
Show InChI InChI=1S/C14H11F3N2O3S/c15-14(16,17)23(22)10-5-3-9(4-6-10)19-13(21)11(7-18)12(20)8-1-2-8/h3-6,8,11H,1-2H2,(H,19,21)
Reactome pathway
n/an/a 16n/an/an/an/an/an/a
Hoechst Marion Roussel
Curated by ChEMBL
Assay Description
Inhibitory concentration tested against enzyme dihydroorotate dehydrogenase in rat
J Med Chem 39: 4608-21 (1996)
Article DOI: 10.1021/jm9604437
BindingDB Entry DOI: 10.7270/Q20G3KSX
Dihydroorotate dehydrogenase
(Mus musculus)
BDBM50054581
((Z)-2-Cyano-3-cyclopropyl-3-hydroxy-N-(4-trifluoro...)
Show SMILES FC(F)(F)S(=O)c1ccc(NC(=O)C(C#N)C(=O)C2CC2)cc1
Show InChI InChI=1S/C14H11F3N2O3S/c15-14(16,17)23(22)10-5-3-9(4-6-10)19-13(21)11(7-18)12(20)8-1-2-8/h3-6,8,11H,1-2H2,(H,19,21)
Reactome pathway
n/an/a 417n/an/an/an/an/an/a
Hoechst Marion Roussel
Curated by ChEMBL
Assay Description
Inhibitory concentration tested on enzyme dihydroorotate dehydrogenase in mouse
J Med Chem 39: 4608-21 (1996)
Article DOI: 10.1021/jm9604437
BindingDB Entry DOI: 10.7270/Q20G3KSX