BDBM50054833 3-{4-[((E)-Tridec-2-enyl)oxymethyl]-phenyl}-propionic acid::CHEMBL144564
SMILES: CCCCCCCCCC\C=C\COCc1ccc(CCC(O)=O)cc1
InChI Key: InChIKey=YIOIWUHXZCTWMX-VAWYXSNFSA-N
Data: 1 IC50
Activity Spreadsheet -- Enzyme Inhibition Constant Data from BindingDB
Found 1 hit for monomerid = 50054833
Trg + Lig
Ki
nM
ΔG°
kcal/mole
IC50
nM
Kd
nM
EC50/IC50
nM
koff
s-1
kon
M-1s-1
pHTemp
°C
Arachidonate 12-lipoxygenase
(Sus scrofa)
BDBM50054833
(3-{4-[((E)-Tridec-2-enyl)oxymethyl]-phenyl}-propio...)
Show SMILES CCCCCCCCCC\C=C\COCc1ccc(CCC(O)=O)cc1
Show InChI InChI=1S/C23H36O3/c1-2-3-4-5-6-7-8-9-10-11-12-19-26-20-22-15-13-21(14-16-22)17-18-23(24)25/h11-16H,2-10,17-20H2,1H3,(H,24,25)/b12-11+
Reactome pathway
n/an/a 40n/an/an/an/an/an/a
Wayne State University
Curated by ChEMBL
Assay Description
Inhibitory activity against conversion of [1-14C]-arachidonic acid to 12-HPETE and its reduction product 12-HETE by porcine leukocyte type 12-lipoxyg...
J Med Chem 39: 4871-8 (1997)
Article DOI: 10.1021/jm9606047
BindingDB Entry DOI: 10.7270/Q2BR8R81