BDBM50054963 (4aS,4bR,5S,6aS,6bR,8R,9aR)-6b-Ethylsulfanyl-4b-fluoro-5-hydroxy-4a,6a-dimethyl-8-propyl-4a,4b,5,6,6a,6b,9a,10,10a,10b,11,12-dodecahydro-7,9-dioxa-pentaleno[2,1-a]phenanthren-2-one::CHEMBL143729
SMILES: CCC[C@@H]1O[C@@H]2CC3C4CCC5=CC(=O)C=C[C@]5(C)[C@@]4(F)[C@@H](O)C[C@]3(C)[C@@]2(O1)SCC
InChI Key: InChIKey=UPGFSDYCNLVAHR-MYBFCEEUSA-N
Data: 1 IC50
Activity Spreadsheet -- Enzyme Inhibition Constant Data from BindingDB
Found 1 hit for monomerid = 50054963
Trg + Lig
Ki
nM
ΔG°
kcal/mole
IC50
nM
Kd
nM
EC50/IC50
nM
koff
s-1
kon
M-1s-1
pHTemp
°C
Glucocorticoid
(RAT)
BDBM50054963
((4aS,4bR,5S,6aS,6bR,8R,9aR)-6b-Ethylsulfanyl-4b-fl...)
Show SMILES CCC[C@@H]1O[C@@H]2CC3C4CCC5=CC(=O)C=C[C@]5(C)[C@@]4(F)[C@@H](O)C[C@]3(C)[C@@]2(O1)SCC |c:15,t:11|
Show InChI InChI=1S/C25H35FO4S/c1-5-7-21-29-20-13-18-17-9-8-15-12-16(27)10-11-22(15,3)24(17,26)19(28)14-23(18,4)25(20,30-21)31-6-2/h10-12,17-21,28H,5-9,13-14H2,1-4H3/t17?,18?,19-,20+,21+,22-,23-,24-,25-/m0/s1
n/an/a 3.30n/an/an/an/an/an/a
Rh£ne-Poulenc Rorer Central Research
Curated by ChEMBL
Assay Description
Steroid binding against the rat thymus glucocorticoid receptor
J Med Chem 39: 4888-96 (1997)
Article DOI: 10.1021/jm9604639
BindingDB Entry DOI: 10.7270/Q23779C8