BDBM50055033 CHEMBL3325884
SMILES: Oc1c(F)cc(F)cc1-c1ccc(\C=C2/SC(=O)NC2=O)o1
InChI Key: InChIKey=DBMBIVBFQOYZEO-WZUFQYTHSA-N
Data: 1 IC50
Activity Spreadsheet -- Enzyme Inhibition Constant Data from BindingDB
Found 1 hit for monomerid = 50055033
Trg + Lig
Ki
nM
ΔG°
kcal/mole
IC50
nM
Kd
nM
EC50/IC50
nM
koff
s-1
kon
M-1s-1
pHTemp
°C
Phosphatidylinositol 4,5-bisphosphate 3-kinase catalytic subunit gamma isoform
(Homo sapiens (Human))
BDBM50055033
(CHEMBL3325884)
Show SMILES Oc1c(F)cc(F)cc1-c1ccc(\C=C2/SC(=O)NC2=O)o1
Show InChI InChI=1S/C14H7F2NO4S/c15-6-3-8(12(18)9(16)4-6)10-2-1-7(21-10)5-11-13(19)17-14(20)22-11/h1-5,18H,(H,17,19,20)/b11-5-
NCI pathway
Reactome pathway
n/an/a 29n/an/an/an/an/an/a
The University of Jordan
Curated by ChEMBL
Assay Description
Inhibition of PI3Kgamma (unknown origin) assessed as decrease in fluorescence intensity using phosphorylated substrate
Eur J Med Chem 84: 454-65 (2014)
Article DOI: 10.1016/j.ejmech.2014.07.056
BindingDB Entry DOI: 10.7270/Q2057HM8