BDBM50055064 CHEMBL3323511
SMILES: CN1CCN(C2C(CCCC12)N1CCCC1)C(=O)Cc1ccc(Cl)c(Cl)c1
InChI Key: InChIKey=CQXHKVAZLJKFTQ-UHFFFAOYSA-N
Data: 3 KI  1 EC50
Activity Spreadsheet -- Enzyme Inhibition Constant Data from BindingDB
Found 4 hits for monomerid = 50055064
Trg + Lig
Ki
nM
ΔG°
kcal/mole
IC50
nM
Kd
nM
EC50/IC50
nM
koff
s-1
kon
M-1s-1
pHTemp
°C
Kappa-type opioid receptor
(Cavia porcellus (domestic guinea pig))
BDBM50055064
(CHEMBL3323511)
Show SMILES CN1CCN(C2C(CCCC12)N1CCCC1)C(=O)Cc1ccc(Cl)c(Cl)c1
Show InChI InChI=1S/C21H29Cl2N3O/c1-24-11-12-26(20(27)14-15-7-8-16(22)17(23)13-15)21-18(24)5-4-6-19(21)25-9-2-3-10-25/h7-8,13,18-19,21H,2-6,9-12,14H2,1H3
2.70n/an/an/an/an/an/an/an/a
Westf£lische Wilhelms-Universit£t M£nster
Curated by ChEMBL
Assay Description
Displacement of [3H]U-69593 from kappa opioid receptor in guinea pig brain membranes after 2 hrs by scintillation counting analysis
J Med Chem 57: 6845-60 (2014)
Article DOI: 10.1021/jm500940q
BindingDB Entry DOI: 10.7270/Q2G73GDP
Kappa-type opioid receptor
(Cavia porcellus (domestic guinea pig))
BDBM50055064
(CHEMBL3323511)
Show SMILES CN1CCN(C2C(CCCC12)N1CCCC1)C(=O)Cc1ccc(Cl)c(Cl)c1
Show InChI InChI=1S/C21H29Cl2N3O/c1-24-11-12-26(20(27)14-15-7-8-16(22)17(23)13-15)21-18(24)5-4-6-19(21)25-9-2-3-10-25/h7-8,13,18-19,21H,2-6,9-12,14H2,1H3
39n/an/an/an/an/an/an/an/a
Westf£lische Wilhelms-Universit£t M£nster
Curated by ChEMBL
Assay Description
Displacement of [3H]Cl-977 from kappa opioid receptor in guinea pig brain membranes after 2 hrs by scintillation counting analysis
J Med Chem 57: 6845-60 (2014)
Article DOI: 10.1021/jm500940q
BindingDB Entry DOI: 10.7270/Q2G73GDP
Mu-type opioid receptor
(Homo sapiens (Human))
BDBM50055064
(CHEMBL3323511)
Show SMILES CN1CCN(C2C(CCCC12)N1CCCC1)C(=O)Cc1ccc(Cl)c(Cl)c1
Show InChI InChI=1S/C21H29Cl2N3O/c1-24-11-12-26(20(27)14-15-7-8-16(22)17(23)13-15)21-18(24)5-4-6-19(21)25-9-2-3-10-25/h7-8,13,18-19,21H,2-6,9-12,14H2,1H3
NCI pathway
Reactome pathway
5.10E+3n/an/an/an/an/an/an/an/a
Westf£lische Wilhelms-Universit£t M£nster
Curated by ChEMBL
Assay Description
Displacement of [3H]-naloxone from human mu opioid receptor expressed in CHO-K1 cells by scintillation counting analysis
J Med Chem 57: 6845-60 (2014)
Article DOI: 10.1021/jm500940q
BindingDB Entry DOI: 10.7270/Q2G73GDP
Kappa-type opioid receptor
(Homo sapiens (Human))
BDBM50055064
(CHEMBL3323511)
Show SMILES CN1CCN(C2C(CCCC12)N1CCCC1)C(=O)Cc1ccc(Cl)c(Cl)c1
Show InChI InChI=1S/C21H29Cl2N3O/c1-24-11-12-26(20(27)14-15-7-8-16(22)17(23)13-15)21-18(24)5-4-6-19(21)25-9-2-3-10-25/h7-8,13,18-19,21H,2-6,9-12,14H2,1H3
Reactome pathway
n/an/an/an/a 20n/an/an/an/a
Westf£lische Wilhelms-Universit£t M£nster
Curated by ChEMBL
Assay Description
Agonist activity at human kappa opioid receptor expressed in HEK-293 cells assessed as stimulation of [35S]-GTPgammaS binding after 30 mins by liquid...
J Med Chem 57: 6845-60 (2014)
Article DOI: 10.1021/jm500940q
BindingDB Entry DOI: 10.7270/Q2G73GDP