BDBM50055370 (3-Aminooxalyl-2-methyl-1-octyl-1H-indol-4-yloxy)-acetic acid::CHEMBL433701
SMILES: CCCCCCCCn1c(C)c(C(=O)C(N)=O)c2c(OCC(O)=O)cccc12
InChI Key: InChIKey=BTAAUCXCDDCOHW-UHFFFAOYSA-N
Data: 3 IC50
Activity Spreadsheet -- Enzyme Inhibition Constant Data from BindingDB
Found 3 hits for monomerid = 50055370
Trg + Lig
Ki
nM
ΔG°
kcal/mole
IC50
nM
Kd
nM
EC50/IC50
nM
koff
s-1
kon
M-1s-1
pHTemp
°C
Phospholipase A2, membrane associated
(Homo sapiens (Human))
BDBM50055370
((3-Aminooxalyl-2-methyl-1-octyl-1H-indol-4-yloxy)-...)
Show SMILES CCCCCCCCn1c(C)c(C(=O)C(N)=O)c2c(OCC(O)=O)cccc12
Show InChI InChI=1S/C21H28N2O5/c1-3-4-5-6-7-8-12-23-14(2)18(20(26)21(22)27)19-15(23)10-9-11-16(19)28-13-17(24)25/h9-11H,3-8,12-13H2,1-2H3,(H2,22,27)(H,24,25)
NCI pathway
Reactome pathway
n/an/a 18n/an/an/an/an/an/a
Lilly Research Laboratories
Curated by ChEMBL
Assay Description
Inhibition of human nonpancreatic secretory Phospholipase A2 through DOC/PC assay
J Med Chem 39: 5159-75 (1997)
Article DOI: 10.1021/jm960487f
BindingDB Entry DOI: 10.7270/Q22B8X54
Phospholipase A2
(Homo sapiens (Human))
BDBM50055370
((3-Aminooxalyl-2-methyl-1-octyl-1H-indol-4-yloxy)-...)
Show SMILES CCCCCCCCn1c(C)c(C(=O)C(N)=O)c2c(OCC(O)=O)cccc12
Show InChI InChI=1S/C21H28N2O5/c1-3-4-5-6-7-8-12-23-14(2)18(20(26)21(22)27)19-15(23)10-9-11-16(19)28-13-17(24)25/h9-11H,3-8,12-13H2,1-2H3,(H2,22,27)(H,24,25)
Reactome pathway
n/an/a 780n/an/an/an/an/an/a
Lilly Research Laboratories
Curated by ChEMBL
Assay Description
Compound was tested for inhibition of human secreted pancreatic PLA2
J Med Chem 39: 5159-75 (1997)
Article DOI: 10.1021/jm960487f
BindingDB Entry DOI: 10.7270/Q22B8X54
Phospholipase A2, membrane associated
(Homo sapiens (Human))
BDBM50055370
((3-Aminooxalyl-2-methyl-1-octyl-1H-indol-4-yloxy)-...)
Show SMILES CCCCCCCCn1c(C)c(C(=O)C(N)=O)c2c(OCC(O)=O)cccc12
Show InChI InChI=1S/C21H28N2O5/c1-3-4-5-6-7-8-12-23-14(2)18(20(26)21(22)27)19-15(23)10-9-11-16(19)28-13-17(24)25/h9-11H,3-8,12-13H2,1-2H3,(H2,22,27)(H,24,25)
NCI pathway
Reactome pathway
n/an/a 8n/an/an/an/an/an/a
Lilly Research Laboratories
Curated by ChEMBL
Assay Description
Inhibition of human nonpancreatic secretory Phospholipase A2 through chromogenic assay
J Med Chem 39: 5159-75 (1997)
Article DOI: 10.1021/jm960487f
BindingDB Entry DOI: 10.7270/Q22B8X54