BDBM50055378 CHEMBL345488::[3-Aminooxalyl-1-(2,6-dichloro-benzyl)-2-methyl-1H-indol-4-yloxy]-acetic acid
SMILES: Cc1c(C(=O)C(N)=O)c2c(OCC(O)=O)cccc2n1Cc1c(Cl)cccc1Cl
InChI Key: InChIKey=AXRTZAZDPVBRMQ-UHFFFAOYSA-N
Data: 2 IC50
Activity Spreadsheet -- Enzyme Inhibition Constant Data from BindingDB
Found 2 hits for monomerid = 50055378
Trg + Lig
Ki
nM
ΔG°
kcal/mole
IC50
nM
Kd
nM
EC50/IC50
nM
koff
s-1
kon
M-1s-1
pHTemp
°C
Phospholipase A2, membrane associated
(Homo sapiens (Human))
BDBM50055378
(CHEMBL345488 | [3-Aminooxalyl-1-(2,6-dichloro-benz...)
Show SMILES Cc1c(C(=O)C(N)=O)c2c(OCC(O)=O)cccc2n1Cc1c(Cl)cccc1Cl
Show InChI InChI=1S/C20H16Cl2N2O5/c1-10-17(19(27)20(23)28)18-14(6-3-7-15(18)29-9-16(25)26)24(10)8-11-12(21)4-2-5-13(11)22/h2-7H,8-9H2,1H3,(H2,23,28)(H,25,26)
NCI pathway
Reactome pathway
n/an/a 22n/an/an/an/an/an/a
Lilly Research Laboratories
Curated by ChEMBL
Assay Description
Inhibition of human nonpancreatic secretory Phospholipase A2 through DOC/PC assay
J Med Chem 39: 5159-75 (1997)
Article DOI: 10.1021/jm960487f
BindingDB Entry DOI: 10.7270/Q22B8X54
Phospholipase A2, membrane associated
(Homo sapiens (Human))
BDBM50055378
(CHEMBL345488 | [3-Aminooxalyl-1-(2,6-dichloro-benz...)
Show SMILES Cc1c(C(=O)C(N)=O)c2c(OCC(O)=O)cccc2n1Cc1c(Cl)cccc1Cl
Show InChI InChI=1S/C20H16Cl2N2O5/c1-10-17(19(27)20(23)28)18-14(6-3-7-15(18)29-9-16(25)26)24(10)8-11-12(21)4-2-5-13(11)22/h2-7H,8-9H2,1H3,(H2,23,28)(H,25,26)
NCI pathway
Reactome pathway
n/an/a 6n/an/an/an/an/an/a
Lilly Research Laboratories
Curated by ChEMBL
Assay Description
Inhibition of human nonpancreatic secretory Phospholipase A2 through chromogenic assay
J Med Chem 39: 5159-75 (1997)
Article DOI: 10.1021/jm960487f
BindingDB Entry DOI: 10.7270/Q22B8X54