BDBM50055385 2-(3-Aminooxalyl-1-benzyl-2-methyl-1H-indol-4-yloxy)-propionic acid::CHEMBL422667
SMILES: CC(Oc1cccc2n(Cc3ccccc3)c(C)c(C(=O)C(N)=O)c12)C(O)=O
InChI Key: InChIKey=GWHFRTCCSTUDBC-UHFFFAOYSA-N
Data: 2 IC50
Activity Spreadsheet -- Enzyme Inhibition Constant Data from BindingDB
Found 2 hits for monomerid = 50055385
Trg + Lig
Ki
nM
ΔG°
kcal/mole
IC50
nM
Kd
nM
EC50/IC50
nM
koff
s-1
kon
M-1s-1
pHTemp
°C
Phospholipase A2, membrane associated
(Homo sapiens (Human))
BDBM50055385
(2-(3-Aminooxalyl-1-benzyl-2-methyl-1H-indol-4-ylox...)
Show SMILES CC(Oc1cccc2n(Cc3ccccc3)c(C)c(C(=O)C(N)=O)c12)C(O)=O
Show InChI InChI=1S/C21H20N2O5/c1-12-17(19(24)20(22)25)18-15(23(12)11-14-7-4-3-5-8-14)9-6-10-16(18)28-13(2)21(26)27/h3-10,13H,11H2,1-2H3,(H2,22,25)(H,26,27)
NCI pathway
Reactome pathway
n/an/a 9n/an/an/an/an/an/a
Lilly Research Laboratories
Curated by ChEMBL
Assay Description
Inhibition of human nonpancreatic secretory Phospholipase A2 through DOC/PC assay
J Med Chem 39: 5159-75 (1997)
Article DOI: 10.1021/jm960487f
BindingDB Entry DOI: 10.7270/Q22B8X54
Phospholipase A2, membrane associated
(Homo sapiens (Human))
BDBM50055385
(2-(3-Aminooxalyl-1-benzyl-2-methyl-1H-indol-4-ylox...)
Show SMILES CC(Oc1cccc2n(Cc3ccccc3)c(C)c(C(=O)C(N)=O)c12)C(O)=O
Show InChI InChI=1S/C21H20N2O5/c1-12-17(19(24)20(22)25)18-15(23(12)11-14-7-4-3-5-8-14)9-6-10-16(18)28-13(2)21(26)27/h3-10,13H,11H2,1-2H3,(H2,22,25)(H,26,27)
NCI pathway
Reactome pathway
n/an/a 10n/an/an/an/an/an/a
Lilly Research Laboratories
Curated by ChEMBL
Assay Description
Inhibition of human nonpancreatic secretory Phospholipase A2 through chromogenic assay
J Med Chem 39: 5159-75 (1997)
Article DOI: 10.1021/jm960487f
BindingDB Entry DOI: 10.7270/Q22B8X54