BDBM50055394 CHEMBL148795::[3-Aminooxalyl-1-(2-chloro-benzyl)-2-methyl-1H-indol-4-yloxy]-acetic acid
SMILES: Cc1c(C(=O)C(N)=O)c2c(OCC(O)=O)cccc2n1Cc1ccccc1Cl
InChI Key: InChIKey=KZWQCRDNTGUQEL-UHFFFAOYSA-N
Data: 2 IC50
Activity Spreadsheet -- Enzyme Inhibition Constant Data from BindingDB
Found 2 hits for monomerid = 50055394
Trg + Lig
Ki
nM
ΔG°
kcal/mole
IC50
nM
Kd
nM
EC50/IC50
nM
koff
s-1
kon
M-1s-1
pHTemp
°C
Phospholipase A2, membrane associated
(Homo sapiens (Human))
BDBM50055394
(CHEMBL148795 | [3-Aminooxalyl-1-(2-chloro-benzyl)-...)
Show SMILES Cc1c(C(=O)C(N)=O)c2c(OCC(O)=O)cccc2n1Cc1ccccc1Cl
Show InChI InChI=1S/C20H17ClN2O5/c1-11-17(19(26)20(22)27)18-14(7-4-8-15(18)28-10-16(24)25)23(11)9-12-5-2-3-6-13(12)21/h2-8H,9-10H2,1H3,(H2,22,27)(H,24,25)
NCI pathway
Reactome pathway
n/an/a 9n/an/an/an/an/an/a
Lilly Research Laboratories
Curated by ChEMBL
Assay Description
Inhibition of human nonpancreatic secretory Phospholipase A2 through chromogenic assay
J Med Chem 39: 5159-75 (1997)
Article DOI: 10.1021/jm960487f
BindingDB Entry DOI: 10.7270/Q22B8X54
Phospholipase A2, membrane associated
(Homo sapiens (Human))
BDBM50055394
(CHEMBL148795 | [3-Aminooxalyl-1-(2-chloro-benzyl)-...)
Show SMILES Cc1c(C(=O)C(N)=O)c2c(OCC(O)=O)cccc2n1Cc1ccccc1Cl
Show InChI InChI=1S/C20H17ClN2O5/c1-11-17(19(26)20(22)27)18-14(7-4-8-15(18)28-10-16(24)25)23(11)9-12-5-2-3-6-13(12)21/h2-8H,9-10H2,1H3,(H2,22,27)(H,24,25)
NCI pathway
Reactome pathway
n/an/a 25n/an/an/an/an/an/a
Lilly Research Laboratories
Curated by ChEMBL
Assay Description
Inhibition of human nonpancreatic secretory Phospholipase A2 through DOC/PC assay
J Med Chem 39: 5159-75 (1997)
Article DOI: 10.1021/jm960487f
BindingDB Entry DOI: 10.7270/Q22B8X54