BDBM50055527 CHEMBL3341920
SMILES: NC(CO)(CCc1ccc(cc1)-c1coc(n1)-c1ccc(Cl)cc1)COP(O)(O)=O
InChI Key: InChIKey=ONZDQUQGLVVPEN-UHFFFAOYSA-N
Data: 2 EC50
Activity Spreadsheet -- Enzyme Inhibition Constant Data from BindingDB
Found 2 hits for monomerid = 50055527
Trg + Lig
Ki
nM
ΔG°
kcal/mole
IC50
nM
Kd
nM
EC50/IC50
nM
koff
s-1
kon
M-1s-1
pHTemp
°C
Sphingosine 1-phosphate receptor 3
(Homo sapiens (Human))
BDBM50055527
(CHEMBL3341920)
Show SMILES NC(CO)(CCc1ccc(cc1)-c1coc(n1)-c1ccc(Cl)cc1)COP(O)(O)=O
Show InChI InChI=1S/C20H22ClN2O6P/c21-17-7-5-16(6-8-17)19-23-18(11-28-19)15-3-1-14(2-4-15)9-10-20(22,12-24)13-29-30(25,26)27/h1-8,11,24H,9-10,12-13,22H2,(H2,25,26,27)
NCI pathway
Reactome pathway
n/an/an/an/a 569n/an/an/an/a
Peking Union Medical College and Chinese Academy of Medical Sciences
Curated by ChEMBL
Assay Description
Agonist activity at human S1P3 receptor expressed in CHO cells preincubated for 2 hrs before IP1 addition by IP1-HTRF assay
Eur J Med Chem 85: 1-15 (2014)
Article DOI: 10.1016/j.ejmech.2014.07.081
BindingDB Entry DOI: 10.7270/Q2X92D0T
Sphingosine 1-phosphate receptor 1
(Homo sapiens (Human))
BDBM50055527
(CHEMBL3341920)
Show SMILES NC(CO)(CCc1ccc(cc1)-c1coc(n1)-c1ccc(Cl)cc1)COP(O)(O)=O
Show InChI InChI=1S/C20H22ClN2O6P/c21-17-7-5-16(6-8-17)19-23-18(11-28-19)15-3-1-14(2-4-15)9-10-20(22,12-24)13-29-30(25,26)27/h1-8,11,24H,9-10,12-13,22H2,(H2,25,26,27)
Reactome pathway
n/an/an/an/a 9.10n/an/an/an/a
Peking Union Medical College and Chinese Academy of Medical Sciences
Curated by ChEMBL
Assay Description
Agonist activity at human S1P1 receptor expressed in CHO cells preincubated for 2 hrs before IP1 addition by IP1-HTRF assay
Eur J Med Chem 85: 1-15 (2014)
Article DOI: 10.1016/j.ejmech.2014.07.081
BindingDB Entry DOI: 10.7270/Q2X92D0T