BDBM50055551 CHEMBL3341928
SMILES: NC(CO)(CCc1ccc(cc1)-c1coc(n1)-c1cccs1)COP(O)(O)=O
InChI Key: InChIKey=VXJMDLOBAFVBJN-UHFFFAOYSA-N
Data: 2 EC50
Activity Spreadsheet -- Enzyme Inhibition Constant Data from BindingDB
Found 2 hits for monomerid = 50055551
Trg + Lig
Ki
nM
ΔG°
kcal/mole
IC50
nM
Kd
nM
EC50/IC50
nM
koff
s-1
kon
M-1s-1
pHTemp
°C
Sphingosine 1-phosphate receptor 3
(Homo sapiens (Human))
BDBM50055551
(CHEMBL3341928)
Show SMILES NC(CO)(CCc1ccc(cc1)-c1coc(n1)-c1cccs1)COP(O)(O)=O
Show InChI InChI=1S/C18H21N2O6PS/c19-18(11-21,12-26-27(22,23)24)8-7-13-3-5-14(6-4-13)15-10-25-17(20-15)16-2-1-9-28-16/h1-6,9-10,21H,7-8,11-12,19H2,(H2,22,23,24)
NCI pathway
Reactome pathway
n/an/an/an/a 869n/an/an/an/a
Peking Union Medical College and Chinese Academy of Medical Sciences
Curated by ChEMBL
Assay Description
Agonist activity at human S1P3 receptor expressed in CHO cells preincubated for 2 hrs before IP1 addition by IP1-HTRF assay
Eur J Med Chem 85: 1-15 (2014)
Article DOI: 10.1016/j.ejmech.2014.07.081
BindingDB Entry DOI: 10.7270/Q2X92D0T
Sphingosine 1-phosphate receptor 1
(Homo sapiens (Human))
BDBM50055551
(CHEMBL3341928)
Show SMILES NC(CO)(CCc1ccc(cc1)-c1coc(n1)-c1cccs1)COP(O)(O)=O
Show InChI InChI=1S/C18H21N2O6PS/c19-18(11-21,12-26-27(22,23)24)8-7-13-3-5-14(6-4-13)15-10-25-17(20-15)16-2-1-9-28-16/h1-6,9-10,21H,7-8,11-12,19H2,(H2,22,23,24)
Reactome pathway
n/an/an/an/a 49n/an/an/an/a
Peking Union Medical College and Chinese Academy of Medical Sciences
Curated by ChEMBL
Assay Description
Agonist activity at human S1P1 receptor expressed in CHO cells preincubated for 2 hrs before IP1 addition by IP1-HTRF assay
Eur J Med Chem 85: 1-15 (2014)
Article DOI: 10.1016/j.ejmech.2014.07.081
BindingDB Entry DOI: 10.7270/Q2X92D0T