BDBM50055553 CHEMBL3341930
SMILES: COc1ccc(Cc2nc(co2)-c2ccc(CCC(N)(CO)COP(O)(O)=O)cc2)cc1
InChI Key: InChIKey=HWEUOGCBOUCSRY-UHFFFAOYSA-N
Data: 2 EC50
Activity Spreadsheet -- Enzyme Inhibition Constant Data from BindingDB
Found 2 hits for monomerid = 50055553
Trg + Lig
Ki
nM
ΔG°
kcal/mole
IC50
nM
Kd
nM
EC50/IC50
nM
koff
s-1
kon
M-1s-1
pHTemp
°C
Sphingosine 1-phosphate receptor 3
(Homo sapiens (Human))
BDBM50055553
(CHEMBL3341930)
Show SMILES COc1ccc(Cc2nc(co2)-c2ccc(CCC(N)(CO)COP(O)(O)=O)cc2)cc1
Show InChI InChI=1S/C22H27N2O7P/c1-29-19-8-4-17(5-9-19)12-21-24-20(13-30-21)18-6-2-16(3-7-18)10-11-22(23,14-25)15-31-32(26,27)28/h2-9,13,25H,10-12,14-15,23H2,1H3,(H2,26,27,28)
NCI pathway
Reactome pathway
n/an/an/an/a 899n/an/an/an/a
Peking Union Medical College and Chinese Academy of Medical Sciences
Curated by ChEMBL
Assay Description
Agonist activity at human S1P3 receptor expressed in CHO cells preincubated for 2 hrs before IP1 addition by IP1-HTRF assay
Eur J Med Chem 85: 1-15 (2014)
Article DOI: 10.1016/j.ejmech.2014.07.081
BindingDB Entry DOI: 10.7270/Q2X92D0T
Sphingosine 1-phosphate receptor 1
(Homo sapiens (Human))
BDBM50055553
(CHEMBL3341930)
Show SMILES COc1ccc(Cc2nc(co2)-c2ccc(CCC(N)(CO)COP(O)(O)=O)cc2)cc1
Show InChI InChI=1S/C22H27N2O7P/c1-29-19-8-4-17(5-9-19)12-21-24-20(13-30-21)18-6-2-16(3-7-18)10-11-22(23,14-25)15-31-32(26,27)28/h2-9,13,25H,10-12,14-15,23H2,1H3,(H2,26,27,28)
Reactome pathway
n/an/an/an/a 26n/an/an/an/a
Peking Union Medical College and Chinese Academy of Medical Sciences
Curated by ChEMBL
Assay Description
Agonist activity at human S1P1 receptor expressed in CHO cells preincubated for 2 hrs before IP1 addition by IP1-HTRF assay
Eur J Med Chem 85: 1-15 (2014)
Article DOI: 10.1016/j.ejmech.2014.07.081
BindingDB Entry DOI: 10.7270/Q2X92D0T