BDBM50055574 CHEMBL3321798
SMILES: [H][C@]12CCCC[C@]1([H])CN(CC\C=C\CCN1C(=O)Cc3ccccc13)CC2
InChI Key: InChIKey=STLOWRIFEMHPHS-QTNQTPCRSA-N
Data: 2 KI  1 IC50  1 EC50
Activity Spreadsheet -- Enzyme Inhibition Constant Data from BindingDB
Found 4 hits for monomerid = 50055574
Trg + Lig
Ki
nM
ΔG°
kcal/mole
IC50
nM
Kd
nM
EC50/IC50
nM
koff
s-1
kon
M-1s-1
pHTemp
°C
5-hydroxytryptamine receptor 7
(Homo sapiens (Human))
BDBM50055574
(CHEMBL3321798)
Show SMILES [H][C@]12CCCC[C@]1([H])CN(CC\C=C\CCN1C(=O)Cc3ccccc13)CC2 |r|
Show InChI InChI=1S/C23H32N2O/c26-23-17-20-10-5-6-12-22(20)25(23)15-8-2-1-7-14-24-16-13-19-9-3-4-11-21(19)18-24/h1-2,5-6,10,12,19,21H,3-4,7-9,11,13-18H2/b2-1+/t19-,21-/m1/s1
Reactome pathway
2.70n/an/an/an/an/an/an/an/a
Universidad Complutense de Madrid
Curated by ChEMBL
Assay Description
Displacement of [3H]LSD from human 5-HT7 expressed in HEK-293 cells after 120 mins by scintillation spectrometry
J Med Chem 57: 6879-84 (2014)
Article DOI: 10.1021/jm500880c
BindingDB Entry DOI: 10.7270/Q2J104TB
5-hydroxytryptamine receptor 1A
(Homo sapiens (Human))
BDBM50055574
(CHEMBL3321798)
Show SMILES [H][C@]12CCCC[C@]1([H])CN(CC\C=C\CCN1C(=O)Cc3ccccc13)CC2 |r|
Show InChI InChI=1S/C23H32N2O/c26-23-17-20-10-5-6-12-22(20)25(23)15-8-2-1-7-14-24-16-13-19-9-3-4-11-21(19)18-24/h1-2,5-6,10,12,19,21H,3-4,7-9,11,13-18H2/b2-1+/t19-,21-/m1/s1
>1.00E+3n/an/an/an/an/an/an/an/a
Universidad Complutense de Madrid
Curated by ChEMBL
Assay Description
Displacement of [3H]-8-OH-DPAT from human 5-HT1A expressed in CHO-K1 cells after 120 mins by scintillation spectrometry
J Med Chem 57: 6879-84 (2014)
Article DOI: 10.1021/jm500880c
BindingDB Entry DOI: 10.7270/Q2J104TB
5-hydroxytryptamine receptor 7
(Homo sapiens (Human))
BDBM50055574
(CHEMBL3321798)
Show SMILES [H][C@]12CCCC[C@]1([H])CN(CC\C=C\CCN1C(=O)Cc3ccccc13)CC2 |r|
Show InChI InChI=1S/C23H32N2O/c26-23-17-20-10-5-6-12-22(20)25(23)15-8-2-1-7-14-24-16-13-19-9-3-4-11-21(19)18-24/h1-2,5-6,10,12,19,21H,3-4,7-9,11,13-18H2/b2-1+/t19-,21-/m1/s1
Reactome pathway
n/an/an/an/a 60n/an/an/an/a
Universidad Complutense de Madrid
Curated by ChEMBL
Assay Description
Agonist activity at human 5-HT7 expressed in HEK-293 cells assessed as increase in cAMP level after 45 mins by HTRF assay
J Med Chem 57: 6879-84 (2014)
Article DOI: 10.1021/jm500880c
BindingDB Entry DOI: 10.7270/Q2J104TB
5-hydroxytryptamine receptor 7
(Homo sapiens (Human))
BDBM50055574
(CHEMBL3321798)
Show SMILES [H][C@]12CCCC[C@]1([H])CN(CC\C=C\CCN1C(=O)Cc3ccccc13)CC2 |r|
Show InChI InChI=1S/C23H32N2O/c26-23-17-20-10-5-6-12-22(20)25(23)15-8-2-1-7-14-24-16-13-19-9-3-4-11-21(19)18-24/h1-2,5-6,10,12,19,21H,3-4,7-9,11,13-18H2/b2-1+/t19-,21-/m1/s1
Reactome pathway
n/an/a 2.30E+3n/an/an/an/an/an/a
Universidad Complutense de Madrid
Curated by ChEMBL
Assay Description
Antagonist activity at human 5-HT7 expressed in HEK-293 cells assessed as inhibition in serotonin-induced increase in cAMP level after 45 mins by HTR...
J Med Chem 57: 6879-84 (2014)
Article DOI: 10.1021/jm500880c
BindingDB Entry DOI: 10.7270/Q2J104TB