BDBM50055624 CHEMBL428836::[(S)-1-[(R)-1-{(R)-2-Benzyloxy-1-[(R)-1-((S)-1-carbamoyl-ethylcarbamoyl)-2-(1H-indol-3-yl)-ethylcarbamoyl]-ethylcarbamoyl}-2-(4-benzyloxy-phenyl)-ethylcarbamoyl]-2-(1H-imidazol-4-yl)-ethyl]-carbamic acid benzyl ester
SMILES: C[C@H](NC(=O)[C@@H](Cc1c[nH]c2ccccc12)NC(=O)[C@@H](COCc1ccccc1)NC(=O)[C@@H](Cc1ccc(OCc2ccccc2)cc1)NC(=O)[C@H](Cc1cnc[nH]1)NC(=O)OCc1ccccc1)C(N)=O
InChI Key: InChIKey=LMBPTRXCFXWLRW-BQHITMPDSA-N
Data: 1 IC50
Activity Spreadsheet -- Enzyme Inhibition Constant Data from BindingDB
Found 1 hit for monomerid = 50055624
Trg + Lig
Ki
nM
ΔG°
kcal/mole
IC50
nM
Kd
nM
EC50/IC50
nM
koff
s-1
kon
M-1s-1
pHTemp
°C
Protein Farnesyltransferase (PFT)/farnesyltransferase beta subunit
(Rattus norvegicus-Rattus norvegicus (rat))
BDBM50055624
(CHEMBL428836 | [(S)-1-[(R)-1-{(R)-2-Benzyloxy-1-[(...)
Show SMILES C[C@H](NC(=O)[C@@H](Cc1c[nH]c2ccccc12)NC(=O)[C@@H](COCc1ccccc1)NC(=O)[C@@H](Cc1ccc(OCc2ccccc2)cc1)NC(=O)[C@H](Cc1cnc[nH]1)NC(=O)OCc1ccccc1)C(N)=O
Show InChI InChI=1S/C54H57N9O9/c1-35(49(55)64)59-50(65)46(26-40-28-57-44-20-12-11-19-43(40)44)61-53(68)48(33-70-30-37-13-5-2-6-14-37)62-51(66)45(25-36-21-23-42(24-22-36)71-31-38-15-7-3-8-16-38)60-52(67)47(27-41-29-56-34-58-41)63-54(69)72-32-39-17-9-4-10-18-39/h2-24,28-29,34-35,45-48,57H,25-27,30-33H2,1H3,(H2,55,64)(H,56,58)(H,59,65)(H,60,67)(H,61,68)(H,62,66)(H,63,69)/t35-,45+,46+,47-,48+/m0/s1
n/an/a 35n/an/an/an/an/an/a
Warner-Lambert Company
Curated by ChEMBL
Assay Description
Inhibitory concentration against rat brain farnesyltransferase
J Med Chem 40: 192-200 (1997)
Article DOI: 10.1021/jm960602m
BindingDB Entry DOI: 10.7270/Q2JW8FJ4