BDBM50055852 CHEMBL3325793
SMILES: CCCC(=O)c1cnn(c1C)-c1ccc(NC(=O)c2cn(CC(=O)N3CCN(C)CC3)c3cc(C)c(Cl)cc23)cc1
InChI Key: InChIKey=BXJRGWPXDMUJRE-UHFFFAOYSA-N
Data: 3 IC50
Activity Spreadsheet -- Enzyme Inhibition Constant Data from BindingDB
Found 3 hits for monomerid = 50055852
Trg + Lig
Ki
nM
ΔG°
kcal/mole
IC50
nM
Kd
nM
EC50/IC50
nM
koff
s-1
kon
M-1s-1
pHTemp
°C
Purinergic receptor P2Y12
(Homo sapiens (Human))
BDBM50055852
(CHEMBL3325793)
Show SMILES CCCC(=O)c1cnn(c1C)-c1ccc(NC(=O)c2cn(CC(=O)N3CCN(C)CC3)c3cc(C)c(Cl)cc23)cc1
Show InChI InChI=1S/C31H35ClN6O3/c1-5-6-29(39)25-17-33-38(21(25)3)23-9-7-22(8-10-23)34-31(41)26-18-37(28-15-20(2)27(32)16-24(26)28)19-30(40)36-13-11-35(4)12-14-36/h7-10,15-18H,5-6,11-14,19H2,1-4H3,(H,34,41)
Reactome pathway
n/an/a 34n/an/an/an/an/an/a
Sanofi R&D
Curated by ChEMBL
Assay Description
Antagonist activity at P2Y12 receptor in Sprague-Dawley rat platelet rich plasma assessed as inhibition of ADP-induced aggregation
J Med Chem 57: 7293-316 (2014)
Article DOI: 10.1021/jm500588w
BindingDB Entry DOI: 10.7270/Q2D79D21
Purinergic receptor P2Y12
(Homo sapiens (Human))
BDBM50055852
(CHEMBL3325793)
Show SMILES CCCC(=O)c1cnn(c1C)-c1ccc(NC(=O)c2cn(CC(=O)N3CCN(C)CC3)c3cc(C)c(Cl)cc23)cc1
Show InChI InChI=1S/C31H35ClN6O3/c1-5-6-29(39)25-17-33-38(21(25)3)23-9-7-22(8-10-23)34-31(41)26-18-37(28-15-20(2)27(32)16-24(26)28)19-30(40)36-13-11-35(4)12-14-36/h7-10,15-18H,5-6,11-14,19H2,1-4H3,(H,34,41)
Reactome pathway
n/an/a 500n/an/an/an/an/an/a
Sanofi R&D
Curated by ChEMBL
Assay Description
Antagonist activity at P2Y12 receptor in human platelet rich plasma assessed as inhibition of ADP-induced aggregation
J Med Chem 57: 7293-316 (2014)
Article DOI: 10.1021/jm500588w
BindingDB Entry DOI: 10.7270/Q2D79D21
Purinergic receptor P2Y12
(Rattus norvegicus)
BDBM50055852
(CHEMBL3325793)
Show SMILES CCCC(=O)c1cnn(c1C)-c1ccc(NC(=O)c2cn(CC(=O)N3CCN(C)CC3)c3cc(C)c(Cl)cc23)cc1
Show InChI InChI=1S/C31H35ClN6O3/c1-5-6-29(39)25-17-33-38(21(25)3)23-9-7-22(8-10-23)34-31(41)26-18-37(28-15-20(2)27(32)16-24(26)28)19-30(40)36-13-11-35(4)12-14-36/h7-10,15-18H,5-6,11-14,19H2,1-4H3,(H,34,41)
Reactome pathway
n/an/a 600n/an/an/an/an/an/a
Sanofi R&D
Curated by ChEMBL
Assay Description
Antagonist activity at P2Y12 receptor in Sprague-Dawley rat platelet rich plasma assessed as inhibition of ADP-induced aggregation
J Med Chem 57: 7293-316 (2014)
Article DOI: 10.1021/jm500588w
BindingDB Entry DOI: 10.7270/Q2D79D21