null
SMILES: [O-][N+](=O)c1cc2[nH]ncc2c2c1ncc1c(F)cccc21
InChI Key: InChIKey=XKUZHDHUOAPVLO-UHFFFAOYSA-N
Activity Spreadsheet -- Enzyme Inhibition Constant Data from BindingDB
Found 1 hit for monomerid = 50055961
Trg + Lig
Ki
nM
ΔG°
kcal/mole
IC50
nM
Kd
nM
EC50/IC50
nM
koff
s-1
kon
M-1s-1
pHTemp
°C
Serine/threonine-protein kinase pim-3
(Homo sapiens (Human))
BDBM50055961
(CHEMBL3326558)
Show SMILES [O-][N+](=O)c1cc2[nH]ncc2c2c1ncc1c(F)cccc21
Show InChI InChI=1S/C14H7FN4O2/c15-10-3-1-2-7-8(10)5-16-14-12(19(20)21)4-11-9(13(7)14)6-17-18-11/h1-6H,(H,17,18)
n/an/a 169n/an/an/an/an/an/a
Clermont Universit£
Curated by ChEMBL
Assay Description
Inhibition of full-length human PIM3 using RSRHSSYPAGT as substrate assessed as residual kinase activity after 30 mins in presence of [gamma-33P]ATP
Bioorg Med Chem 22: 4704-10 (2014)
Article DOI: 10.1016/j.bmc.2014.07.011
BindingDB Entry DOI: 10.7270/Q2MS3VD0