BDBM50056072 (2R,3R,4S)-4-Benzofuran-6-yl-1-dibutylcarbamoylmethyl-2-(4-methoxy-phenyl)-pyrrolidine-3-carboxylic acid::CHEMBL112685
SMILES: CCCCN(CCCC)C(=O)CN1C[C@@H]([C@H]([C@@H]1c1ccc(OC)cc1)C(O)=O)c1ccc2ccoc2c1
InChI Key: InChIKey=WHDVQUAEJOXCTD-ZJGIAAPESA-N
Data: 2 IC50
Activity Spreadsheet -- Enzyme Inhibition Constant Data from BindingDB
Found 2 hits for monomerid = 50056072
Trg + Lig
Ki
nM
ΔG°
kcal/mole
IC50
nM
Kd
nM
EC50/IC50
nM
koff
s-1
kon
M-1s-1
pHTemp
°C
Endothelin receptor ET-B
(Sus scrofa)
BDBM50056072
((2R,3R,4S)-4-Benzofuran-6-yl-1-dibutylcarbamoylmet...)
Show SMILES CCCCN(CCCC)C(=O)CN1C[C@@H]([C@H]([C@@H]1c1ccc(OC)cc1)C(O)=O)c1ccc2ccoc2c1
Show InChI InChI=1S/C30H38N2O5/c1-4-6-15-31(16-7-5-2)27(33)20-32-19-25(23-9-8-21-14-17-37-26(21)18-23)28(30(34)35)29(32)22-10-12-24(36-3)13-11-22/h8-14,17-18,25,28-29H,4-7,15-16,19-20H2,1-3H3,(H,34,35)/t25-,28-,29+/m1/s1
Reactome pathway
n/an/a 5.00E+3n/an/an/an/an/an/a
Abbott Laboratories
Curated by ChEMBL
Assay Description
Binding affinity towards endothelin B receptor in porcine cerebellar tissue using [125I]-ET-1 as radioligand.
J Med Chem 40: 322-30 (1997)
Article DOI: 10.1021/jm960077r
BindingDB Entry DOI: 10.7270/Q20C4TV2
EDNRA
(RAT)
BDBM50056072
((2R,3R,4S)-4-Benzofuran-6-yl-1-dibutylcarbamoylmet...)
Show SMILES CCCCN(CCCC)C(=O)CN1C[C@@H]([C@H]([C@@H]1c1ccc(OC)cc1)C(O)=O)c1ccc2ccoc2c1
Show InChI InChI=1S/C30H38N2O5/c1-4-6-15-31(16-7-5-2)27(33)20-32-19-25(23-9-8-21-14-17-37-26(21)18-23)28(30(34)35)29(32)22-10-12-24(36-3)13-11-22/h8-14,17-18,25,28-29H,4-7,15-16,19-20H2,1-3H3,(H,34,35)/t25-,28-,29+/m1/s1
Reactome pathway
n/an/a 0.700n/an/an/an/an/an/a
Abbott Laboratories
Curated by ChEMBL
Assay Description
Binding affinity towards endothelin A receptor in prolactin secreting rat pituitary cells using [125I]-ET-1 as radioligand.
J Med Chem 40: 322-30 (1997)
Article DOI: 10.1021/jm960077r
BindingDB Entry DOI: 10.7270/Q20C4TV2