BDBM50056107 CHEMBL3326704
SMILES: O=C(NCCCCCCNc1c2CCCCc2nc2ccccc12)c1cc2ccccc2oc1=O
InChI Key: InChIKey=APOYKHBRRMBQBD-UHFFFAOYSA-N
Data: 2 KI  1 IC50
Activity Spreadsheet -- Enzyme Inhibition Constant Data from BindingDB
Found 3 hits for monomerid = 50056107
Trg + Lig
Ki
nM
ΔG°
kcal/mole
IC50
nM
Kd
nM
EC50/IC50
nM
koff
s-1
kon
M-1s-1
pHTemp
°C
Cholinesterases
(Homo sapiens (Human))
BDBM50056107
(CHEMBL3326704)
Show SMILES O=C(NCCCCCCNc1c2CCCCc2nc2ccccc12)c1cc2ccccc2oc1=O
Show InChI InChI=1S/C29H31N3O3/c33-28(23-19-20-11-3-8-16-26(20)35-29(23)34)31-18-10-2-1-9-17-30-27-21-12-4-6-14-24(21)32-25-15-7-5-13-22(25)27/h3-4,6,8,11-12,14,16,19H,1-2,5,7,9-10,13,15,17-18H2,(H,30,32)(H,31,33)
Reactome pathway
16n/an/an/an/an/an/an/an/a
Central China Normal University
Curated by ChEMBL
Assay Description
Inhibition of human BChE assessed as acetylthiocholine hydrolysis
Bioorg Med Chem 22: 4784-91 (2014)
Article DOI: 10.1016/j.bmc.2014.06.057
BindingDB Entry DOI: 10.7270/Q27M09KB
Acetylcholinesterase
(Homo sapiens (Human))
BDBM50056107
(CHEMBL3326704)
Show SMILES O=C(NCCCCCCNc1c2CCCCc2nc2ccccc12)c1cc2ccccc2oc1=O
Show InChI InChI=1S/C29H31N3O3/c33-28(23-19-20-11-3-8-16-26(20)35-29(23)34)31-18-10-2-1-9-17-30-27-21-12-4-6-14-24(21)32-25-15-7-5-13-22(25)27/h3-4,6,8,11-12,14,16,19H,1-2,5,7,9-10,13,15,17-18H2,(H,30,32)(H,31,33)
NCI pathway
Reactome pathway
17n/an/an/an/an/an/an/an/a
Central China Normal University
Curated by ChEMBL
Assay Description
Inhibition of human AChE assessed as acetylthiocholine hydrolysis
Bioorg Med Chem 22: 4784-91 (2014)
Article DOI: 10.1016/j.bmc.2014.06.057
BindingDB Entry DOI: 10.7270/Q27M09KB
Beta-secretase 1
(Homo sapiens (Human))
BDBM50056107
(CHEMBL3326704)
Show SMILES O=C(NCCCCCCNc1c2CCCCc2nc2ccccc12)c1cc2ccccc2oc1=O
Show InChI InChI=1S/C29H31N3O3/c33-28(23-19-20-11-3-8-16-26(20)35-29(23)34)31-18-10-2-1-9-17-30-27-21-12-4-6-14-24(21)32-25-15-7-5-13-22(25)27/h3-4,6,8,11-12,14,16,19H,1-2,5,7,9-10,13,15,17-18H2,(H,30,32)(H,31,33)
n/an/a 1.72E+4n/an/an/an/an/an/a
Central China Normal University
Curated by ChEMBL
Assay Description
Inhibition of beta-secretase (unknown origin) using 150 nM Rhodamine-EVNLDAEFK-quencher substrate proteolysis by fluorescence resonance energy transf...
Bioorg Med Chem 22: 4784-91 (2014)
Article DOI: 10.1016/j.bmc.2014.06.057
BindingDB Entry DOI: 10.7270/Q27M09KB