BDBM50056109 CHEMBL3326709
SMILES: FC(F)(F)Oc1ccc2oc(=O)c(cc2c1)C(=O)NCCCCCCNc1c2CCCCc2nc2ccccc12
InChI Key: InChIKey=QTJIWFKUPQRREG-UHFFFAOYSA-N
Data: 2 KI  1 IC50
Activity Spreadsheet -- Enzyme Inhibition Constant Data from BindingDB
Found 3 hits for monomerid = 50056109
Trg + Lig
Ki
nM
ΔG°
kcal/mole
IC50
nM
Kd
nM
EC50/IC50
nM
koff
s-1
kon
M-1s-1
pHTemp
°C
Cholinesterases
(Homo sapiens (Human))
BDBM50056109
(CHEMBL3326709)
Show SMILES FC(F)(F)Oc1ccc2oc(=O)c(cc2c1)C(=O)NCCCCCCNc1c2CCCCc2nc2ccccc12
Show InChI InChI=1S/C30H30F3N3O4/c31-30(32,33)40-20-13-14-26-19(17-20)18-23(29(38)39-26)28(37)35-16-8-2-1-7-15-34-27-21-9-3-5-11-24(21)36-25-12-6-4-10-22(25)27/h3,5,9,11,13-14,17-18H,1-2,4,6-8,10,12,15-16H2,(H,34,36)(H,35,37)
Reactome pathway
18n/an/an/an/an/an/an/an/a
Central China Normal University
Curated by ChEMBL
Assay Description
Inhibition of human BChE assessed as acetylthiocholine hydrolysis
Bioorg Med Chem 22: 4784-91 (2014)
Article DOI: 10.1016/j.bmc.2014.06.057
BindingDB Entry DOI: 10.7270/Q27M09KB
Acetylcholinesterase
(Homo sapiens (Human))
BDBM50056109
(CHEMBL3326709)
Show SMILES FC(F)(F)Oc1ccc2oc(=O)c(cc2c1)C(=O)NCCCCCCNc1c2CCCCc2nc2ccccc12
Show InChI InChI=1S/C30H30F3N3O4/c31-30(32,33)40-20-13-14-26-19(17-20)18-23(29(38)39-26)28(37)35-16-8-2-1-7-15-34-27-21-9-3-5-11-24(21)36-25-12-6-4-10-22(25)27/h3,5,9,11,13-14,17-18H,1-2,4,6-8,10,12,15-16H2,(H,34,36)(H,35,37)
NCI pathway
Reactome pathway
60n/an/an/an/an/an/an/an/a
Central China Normal University
Curated by ChEMBL
Assay Description
Inhibition of human AChE assessed as acetylthiocholine hydrolysis
Bioorg Med Chem 22: 4784-91 (2014)
Article DOI: 10.1016/j.bmc.2014.06.057
BindingDB Entry DOI: 10.7270/Q27M09KB
Beta-secretase 1
(Homo sapiens (Human))
BDBM50056109
(CHEMBL3326709)
Show SMILES FC(F)(F)Oc1ccc2oc(=O)c(cc2c1)C(=O)NCCCCCCNc1c2CCCCc2nc2ccccc12
Show InChI InChI=1S/C30H30F3N3O4/c31-30(32,33)40-20-13-14-26-19(17-20)18-23(29(38)39-26)28(37)35-16-8-2-1-7-15-34-27-21-9-3-5-11-24(21)36-25-12-6-4-10-22(25)27/h3,5,9,11,13-14,17-18H,1-2,4,6-8,10,12,15-16H2,(H,34,36)(H,35,37)
n/an/a 2.26E+4n/an/an/an/an/an/a
Central China Normal University
Curated by ChEMBL
Assay Description
Inhibition of beta-secretase (unknown origin) using 150 nM Rhodamine-EVNLDAEFK-quencher substrate proteolysis by fluorescence resonance energy transf...
Bioorg Med Chem 22: 4784-91 (2014)
Article DOI: 10.1016/j.bmc.2014.06.057
BindingDB Entry DOI: 10.7270/Q27M09KB