BDBM50056353 CHEMBL3326576
SMILES: CC1(C)C[C@@H](NC(=O)Nc2cccc3cnccc23)c2ccc(OC(F)(F)F)cc2O1
InChI Key: InChIKey=MZVVZQZAVDLFTI-GOSISDBHSA-N
Data: 3 IC50
Activity Spreadsheet -- Enzyme Inhibition Constant Data from BindingDB
Found 3 hits for monomerid = 50056353
Trg + Lig
Ki
nM
ΔG°
kcal/mole
IC50
nM
Kd
nM
EC50/IC50
nM
koff
s-1
kon
M-1s-1
pHTemp
°C
Cytochrome P450 3A4
(Homo sapiens (Human))
BDBM50056353
(CHEMBL3326576)
Show SMILES CC1(C)C[C@@H](NC(=O)Nc2cccc3cnccc23)c2ccc(OC(F)(F)F)cc2O1 |r|
Show InChI InChI=1S/C22H20F3N3O3/c1-21(2)11-18(16-7-6-14(10-19(16)31-21)30-22(23,24)25)28-20(29)27-17-5-3-4-13-12-26-9-8-15(13)17/h3-10,12,18H,11H2,1-2H3,(H2,27,28,29)/t18-/m1/s1
Reactome pathway
n/an/a 2.20E+3n/an/an/an/an/an/a
AbbVie Inc.
Curated by ChEMBL
Assay Description
Inhibition of CYP3A4 in human liver microsomes using 7-benzyloxyquiniline substrate and NADPH incubated up to 2 hrs
J Med Chem 57: 7412-24 (2014)
Article DOI: 10.1021/jm500916t
BindingDB Entry DOI: 10.7270/Q2Z3219J
Transient receptor potential cation channel subfamily V member 1
(Homo sapiens (Human))
BDBM50056353
(CHEMBL3326576)
Show SMILES CC1(C)C[C@@H](NC(=O)Nc2cccc3cnccc23)c2ccc(OC(F)(F)F)cc2O1 |r|
Show InChI InChI=1S/C22H20F3N3O3/c1-21(2)11-18(16-7-6-14(10-19(16)31-21)30-22(23,24)25)28-20(29)27-17-5-3-4-13-12-26-9-8-15(13)17/h3-10,12,18H,11H2,1-2H3,(H2,27,28,29)/t18-/m1/s1
Reactome pathway
n/an/a 6n/an/an/an/an/an/a
AbbVie Inc.
Curated by ChEMBL
Assay Description
Antagonist activity against human TRPV1 expressed in HEK293 cells assessed as capsaicin-induced calcium flux by FLIPR assay
J Med Chem 57: 7412-24 (2014)
Article DOI: 10.1021/jm500916t
BindingDB Entry DOI: 10.7270/Q2Z3219J
Cytochrome P450 2D6
(Homo sapiens (Human))
BDBM50056353
(CHEMBL3326576)
Show SMILES CC1(C)C[C@@H](NC(=O)Nc2cccc3cnccc23)c2ccc(OC(F)(F)F)cc2O1 |r|
Show InChI InChI=1S/C22H20F3N3O3/c1-21(2)11-18(16-7-6-14(10-19(16)31-21)30-22(23,24)25)28-20(29)27-17-5-3-4-13-12-26-9-8-15(13)17/h3-10,12,18H,11H2,1-2H3,(H2,27,28,29)/t18-/m1/s1
n/an/a 80n/an/an/an/an/an/a
AbbVie Inc.
Curated by ChEMBL
Assay Description
Inhibition of CYP2D6 in human liver microsomes using AMMC substrate and NADPH incubated up to 2 hrs
J Med Chem 57: 7412-24 (2014)
Article DOI: 10.1021/jm500916t
BindingDB Entry DOI: 10.7270/Q2Z3219J