BDBM50056358 CHEMBL3326581
SMILES: Cc1cc2c(NC(=O)N[C@@H]3CC(C)(C)Oc4cc(F)ccc34)cccc2cn1
InChI Key: InChIKey=QGYOUMYRQKOXET-LJQANCHMSA-N
Data: 3 IC50
Activity Spreadsheet -- Enzyme Inhibition Constant Data from BindingDB
Found 3 hits for monomerid = 50056358
Trg + Lig
Ki
nM
ΔG°
kcal/mole
IC50
nM
Kd
nM
EC50/IC50
nM
koff
s-1
kon
M-1s-1
pHTemp
°C
Cytochrome P450 3A4
(Homo sapiens (Human))
BDBM50056358
(CHEMBL3326581)
Show SMILES Cc1cc2c(NC(=O)N[C@@H]3CC(C)(C)Oc4cc(F)ccc34)cccc2cn1 |r|
Show InChI InChI=1S/C22H22FN3O2/c1-13-9-17-14(12-24-13)5-4-6-18(17)25-21(27)26-19-11-22(2,3)28-20-10-15(23)7-8-16(19)20/h4-10,12,19H,11H2,1-3H3,(H2,25,26,27)/t19-/m1/s1
Reactome pathway
n/an/a>2.00E+4n/an/an/an/an/an/a
AbbVie Inc.
Curated by ChEMBL
Assay Description
Inhibition of CYP3A4 in human liver microsomes using 7-benzyloxyquiniline substrate and NADPH incubated up to 2 hrs
J Med Chem 57: 7412-24 (2014)
Article DOI: 10.1021/jm500916t
BindingDB Entry DOI: 10.7270/Q2Z3219J
Transient receptor potential cation channel subfamily V member 1
(Homo sapiens (Human))
BDBM50056358
(CHEMBL3326581)
Show SMILES Cc1cc2c(NC(=O)N[C@@H]3CC(C)(C)Oc4cc(F)ccc34)cccc2cn1 |r|
Show InChI InChI=1S/C22H22FN3O2/c1-13-9-17-14(12-24-13)5-4-6-18(17)25-21(27)26-19-11-22(2,3)28-20-10-15(23)7-8-16(19)20/h4-10,12,19H,11H2,1-3H3,(H2,25,26,27)/t19-/m1/s1
Reactome pathway
n/an/a 3n/an/an/an/an/an/a
AbbVie Inc.
Curated by ChEMBL
Assay Description
Antagonist activity against human TRPV1 expressed in HEK293 cells assessed as capsaicin-induced calcium flux by FLIPR assay
J Med Chem 57: 7412-24 (2014)
Article DOI: 10.1021/jm500916t
BindingDB Entry DOI: 10.7270/Q2Z3219J
Cytochrome P450 2D6
(Homo sapiens (Human))
BDBM50056358
(CHEMBL3326581)
Show SMILES Cc1cc2c(NC(=O)N[C@@H]3CC(C)(C)Oc4cc(F)ccc34)cccc2cn1 |r|
Show InChI InChI=1S/C22H22FN3O2/c1-13-9-17-14(12-24-13)5-4-6-18(17)25-21(27)26-19-11-22(2,3)28-20-10-15(23)7-8-16(19)20/h4-10,12,19H,11H2,1-3H3,(H2,25,26,27)/t19-/m1/s1
n/an/a 1.70E+4n/an/an/an/an/an/a
AbbVie Inc.
Curated by ChEMBL
Assay Description
Inhibition of CYP2D6 in human liver microsomes using AMMC substrate and NADPH incubated up to 2 hrs
J Med Chem 57: 7412-24 (2014)
Article DOI: 10.1021/jm500916t
BindingDB Entry DOI: 10.7270/Q2Z3219J