BDBM50056433 CHEMBL3326910
SMILES: Cc1cc2c(NC(=O)N[C@@H]3CC(CF)(CF)Oc4cc(Cl)ccc34)c(C)ccc2cn1
InChI Key: InChIKey=VSNUIGFDWACQRA-LJQANCHMSA-N
Data: 1 IC50
Activity Spreadsheet -- Enzyme Inhibition Constant Data from BindingDB
Found 1 hit for monomerid = 50056433
Trg + Lig
Ki
nM
ΔG°
kcal/mole
IC50
nM
Kd
nM
EC50/IC50
nM
koff
s-1
kon
M-1s-1
pHTemp
°C
Transient receptor potential cation channel subfamily V member 1
(Homo sapiens (Human))
BDBM50056433
(CHEMBL3326910)
Show SMILES Cc1cc2c(NC(=O)N[C@@H]3CC(CF)(CF)Oc4cc(Cl)ccc34)c(C)ccc2cn1 |r|
Show InChI InChI=1S/C23H22ClF2N3O2/c1-13-3-4-15-10-27-14(2)7-18(15)21(13)29-22(30)28-19-9-23(11-25,12-26)31-20-8-16(24)5-6-17(19)20/h3-8,10,19H,9,11-12H2,1-2H3,(H2,28,29,30)/t19-/m1/s1
Reactome pathway
n/an/a 74n/an/an/an/an/an/a
AbbVie Inc.
Curated by ChEMBL
Assay Description
Antagonist activity against human TRPV1 expressed in HEK293 cells assessed as capsaicin-induced calcium flux by FLIPR assay
J Med Chem 57: 7412-24 (2014)
Article DOI: 10.1021/jm500916t
BindingDB Entry DOI: 10.7270/Q2Z3219J