BDBM50056439 CHEMBL3326568
SMILES: C[C@@H]1CN(CC=C1C(=O)Nc1ccc(cc1)C(F)(F)F)c1ncccc1Cl
InChI Key: InChIKey=IYXRQYVHUISAIP-GFCCVEGCSA-N
Data: 1 IC50
Activity Spreadsheet -- Enzyme Inhibition Constant Data from BindingDB
Found 1 hit for monomerid = 50056439
Trg + Lig
Ki
nM
ΔG°
kcal/mole
IC50
nM
Kd
nM
EC50/IC50
nM
koff
s-1
kon
M-1s-1
pHTemp
°C
Transient receptor potential cation channel subfamily V member 1
(Homo sapiens (Human))
BDBM50056439
(CHEMBL3326568)
Show SMILES C[C@@H]1CN(CC=C1C(=O)Nc1ccc(cc1)C(F)(F)F)c1ncccc1Cl |r,c:5|
Show InChI InChI=1S/C19H17ClF3N3O/c1-12-11-26(17-16(20)3-2-9-24-17)10-8-15(12)18(27)25-14-6-4-13(5-7-14)19(21,22)23/h2-9,12H,10-11H2,1H3,(H,25,27)/t12-/m1/s1
Reactome pathway
n/an/a 21n/an/an/an/an/an/a
AbbVie Inc.
Curated by ChEMBL
Assay Description
Antagonist activity against human TRPV1 expressed in HEK293 cells assessed as capsaicin-induced calcium flux by FLIPR assay
J Med Chem 57: 7412-24 (2014)
Article DOI: 10.1021/jm500916t
BindingDB Entry DOI: 10.7270/Q2Z3219J