BDBM50056498 CHEMBL3334818
SMILES: CC(C)[C@@H](NC(=O)NCc1ccccc1)C(=O)N1CC[C@](O)(c2ccc(Cl)cc2)C(C)(C)C1
InChI Key: InChIKey=VDNLUDJVAVJIJV-GJZUVCINSA-N
Data: 1 IC50
Activity Spreadsheet -- Enzyme Inhibition Constant Data from BindingDB
Found 1 hit for monomerid = 50056498
Trg + Lig
Ki
nM
ΔG°
kcal/mole
IC50
nM
Kd
nM
EC50/IC50
nM
koff
s-1
kon
M-1s-1
pHTemp
°C
C-C chemokine receptor type 1
(Homo sapiens (Human))
BDBM50056498
(CHEMBL3334818)
Show SMILES CC(C)[C@@H](NC(=O)NCc1ccccc1)C(=O)N1CC[C@](O)(c2ccc(Cl)cc2)C(C)(C)C1 |r|
Show InChI InChI=1S/C26H34ClN3O3/c1-18(2)22(29-24(32)28-16-19-8-6-5-7-9-19)23(31)30-15-14-26(33,25(3,4)17-30)20-10-12-21(27)13-11-20/h5-13,18,22,33H,14-17H2,1-4H3,(H2,28,29,32)/t22-,26+/m1/s1
Reactome pathway
n/an/a 1n/an/an/an/an/an/a
Bristol Myers Squibb Company
Curated by ChEMBL
Assay Description
Displacement of [125I]MIP-1alpha from CCR1 in human THP1 cells
J Med Chem 57: 7550-64 (2014)
Article DOI: 10.1021/jm5003167
BindingDB Entry DOI: 10.7270/Q2TB18JC