BDBM50056922 1,4-Dihydroxy-10-methoxy-5,8-dimethyl-3,7-dioxo-1,3-dihydro-7H-benzo[e]furo[3',4':3,4]benzo[b][1,4]dioxepine-11-carbaldehyde::CHEMBL173530::NSC-87511::Stictic acid::Stictic acid (StA), 1::cid_73677
SMILES: COc1cc(C)c2c(Oc3c4C(O)OC(=O)c4c(O)c(C)c3OC2=O)c1C=O
InChI Key: InChIKey=SKCUFZLDTAYNBZ-UHFFFAOYSA-N
Data: 12 IC50  1 EC50
Activity Spreadsheet -- Enzyme Inhibition Constant Data from BindingDB
Found 13 hits for monomerid = 50056922
Trg + Lig
Ki
nM
ΔG°
kcal/mole
IC50
nM
Kd
nM
EC50/IC50
nM
koff
s-1
kon
M-1s-1
pHTemp
°C
DNA repair protein RAD51 homolog 1
(Homo sapiens (Human))
BDBM50056922
(1,4-Dihydroxy-10-methoxy-5,8-dimethyl-3,7-dioxo-1,...)
Show SMILES COc1cc(C)c2c(Oc3c4C(O)OC(=O)c4c(O)c(C)c3OC2=O)c1C=O
Show InChI InChI=1S/C19H14O9/c1-6-4-9(25-3)8(5-20)15-10(6)17(22)27-14-7(2)13(21)11-12(16(14)26-15)19(24)28-18(11)23/h4-5,19,21,24H,1-3H3
Reactome pathway
PCBioAssay
n/an/a 8.50E+4n/an/an/an/an/an/a
PCMD
Curated by PubChem BioAssay
Assay Description
Project Title: A screen for modulators of human Rad51, a key DNA repair protein Application Number: MH084119 Assay Submitter: Dr. Alex Mazin Submitte...
PubChem Bioassay (2008)
BindingDB Entry DOI: 10.7270/Q2VD6WW6
DNA repair protein RAD51 homolog 1
(Homo sapiens (Human))
BDBM50056922
(1,4-Dihydroxy-10-methoxy-5,8-dimethyl-3,7-dioxo-1,...)
Show SMILES COc1cc(C)c2c(Oc3c4C(O)OC(=O)c4c(O)c(C)c3OC2=O)c1C=O
Show InChI InChI=1S/C19H14O9/c1-6-4-9(25-3)8(5-20)15-10(6)17(22)27-14-7(2)13(21)11-12(16(14)26-15)19(24)28-18(11)23/h4-5,19,21,24H,1-3H3
Reactome pathway
PCBioAssay
n/an/a 8.74E+3n/an/an/an/an/an/a
PCMD
Curated by PubChem BioAssay
Assay Description
Project Title: A screen for modulators of human Rad51, a key DNA repair protein Application Number: MH084119 Assay Submitter: Dr. Alex Mazin Submitte...
PubChem Bioassay (2008)
BindingDB Entry DOI: 10.7270/Q2BV7F1T
M1 family aminopeptidase
(Plasmodium falciparum (isolate FcB1 / Columbia))
BDBM50056922
(1,4-Dihydroxy-10-methoxy-5,8-dimethyl-3,7-dioxo-1,...)
Show SMILES COc1cc(C)c2c(Oc3c4C(O)OC(=O)c4c(O)c(C)c3OC2=O)c1C=O
Show InChI InChI=1S/C19H14O9/c1-6-4-9(25-3)8(5-20)15-10(6)17(22)27-14-7(2)13(21)11-12(16(14)26-15)19(24)28-18(11)23/h4-5,19,21,24H,1-3H3
PCBioAssay
n/an/a 2.73E+4n/an/an/an/an/an/a
SRMLSC
Curated by PubChem BioAssay
Assay Description
Southern Research Molecular Libraries Screening Center (SRMLSC) Southern Research Institute (Birmingham, Alabama) NIH Molecular Libraries Screening...
PubChem Bioassay (2008)
BindingDB Entry DOI: 10.7270/Q27H1H0J
Serine/threonine-protein kinase 33
(Homo sapiens (Human))
BDBM50056922
(1,4-Dihydroxy-10-methoxy-5,8-dimethyl-3,7-dioxo-1,...)
Show SMILES COc1cc(C)c2c(Oc3c4C(O)OC(=O)c4c(O)c(C)c3OC2=O)c1C=O
Show InChI InChI=1S/C19H14O9/c1-6-4-9(25-3)8(5-20)15-10(6)17(22)27-14-7(2)13(21)11-12(16(14)26-15)19(24)28-18(11)23/h4-5,19,21,24H,1-3H3
PCBioAssay
n/an/an/an/a 3.20E+4n/an/an/an/a
Broad Institute
Curated by PubChem BioAssay
Assay Description
Keywords: STK33 Kinase, Non-ATP Competitive Inhibitor Assay Overview: Purified STK33 Kinase is preincubated with potential inhibitors and allowed to ...
PubChem Bioassay (2010)
BindingDB Entry DOI: 10.7270/Q2B27SRF
Dual specificity mitogen-activated protein kinase kinase 6
(Homo sapiens (Human))
BDBM50056922
(1,4-Dihydroxy-10-methoxy-5,8-dimethyl-3,7-dioxo-1,...)
Show SMILES COc1cc(C)c2c(Oc3c4C(O)OC(=O)c4c(O)c(C)c3OC2=O)c1C=O
Show InChI InChI=1S/C19H14O9/c1-6-4-9(25-3)8(5-20)15-10(6)17(22)27-14-7(2)13(21)11-12(16(14)26-15)19(24)28-18(11)23/h4-5,19,21,24H,1-3H3
Reactome pathway
n/an/a 2.40E+4n/an/an/an/an/an/a
Yale University School of Medicine
Assay Description
The labeled fragment can be distinguished from full-length MKK by a change in fluorescence polarization. MKK6 was used as a substrate because it cou...
Chem Biol 19: 875-82 (2012)
Article DOI: 10.1016/j.chembiol.2012.05.013
BindingDB Entry DOI: 10.7270/Q22B8WN0
3-hydroxyacyl-[acyl-carrier-protein] dehydratase FabZ [1-175]
(Yersinia pestis)
BDBM50056922
(1,4-Dihydroxy-10-methoxy-5,8-dimethyl-3,7-dioxo-1,...)
Show SMILES COc1cc(C)c2c(Oc3c4C(O)OC(=O)c4c(O)c(C)c3OC2=O)c1C=O
Show InChI InChI=1S/C19H14O9/c1-6-4-9(25-3)8(5-20)15-10(6)17(22)27-14-7(2)13(21)11-12(16(14)26-15)19(24)28-18(11)23/h4-5,19,21,24H,1-3H3
n/an/a 1.30E+4n/an/an/an/a7.025
Brookhaven National Laboratory
Assay Description
The enzymatic activities of FtFabZ and YpFabZ were determined via the reportedspectrophotometric method using the substrate analogue crotonoyl-CoA.7 ...
Biochemistry 55: 1091-9 (2016)
Article DOI: 10.1021/acs.biochem.5b00832
BindingDB Entry DOI: 10.7270/Q2CN72P1
Rho guanine nucleotide exchange factor 1
(Homo sapiens)
BDBM50056922
(1,4-Dihydroxy-10-methoxy-5,8-dimethyl-3,7-dioxo-1,...)
Show SMILES COc1cc(C)c2c(Oc3c4C(O)OC(=O)c4c(O)c(C)c3OC2=O)c1C=O
Show InChI InChI=1S/C19H14O9/c1-6-4-9(25-3)8(5-20)15-10(6)17(22)27-14-7(2)13(21)11-12(16(14)26-15)19(24)28-18(11)23/h4-5,19,21,24H,1-3H3
n/an/a 1.87E+5n/an/an/an/an/an/a
Universit£ Paris-Saclay
Curated by ChEMBL
Assay Description
Inhibition of p115 DHPH22 domain (395 to 766 residues) (unknown origin) interaction with GDP-loaded His-tagged RhoA F25N mutant (1 to 180 residues) a...
J Nat Prod 81: 1610-1618 (2018)
Article DOI: 10.1021/acs.jnatprod.8b00209
BindingDB Entry DOI: 10.7270/Q23T9KR4
Integrase
(Human immunodeficiency virus 1)
BDBM50056922
(1,4-Dihydroxy-10-methoxy-5,8-dimethyl-3,7-dioxo-1,...)
Show SMILES COc1cc(C)c2c(Oc3c4C(O)OC(=O)c4c(O)c(C)c3OC2=O)c1C=O
Show InChI InChI=1S/C19H14O9/c1-6-4-9(25-3)8(5-20)15-10(6)17(22)27-14-7(2)13(21)11-12(16(14)26-15)19(24)28-18(11)23/h4-5,19,21,24H,1-3H3
n/an/a 4.40E+3n/an/an/an/an/an/a
National Cancer Institute
Curated by ChEMBL
Assay Description
Inhibitory concentration of compound against 3'-processing of HIV-1 integrase in experiment 1
J Med Chem 40: 942-51 (1997)
Article DOI: 10.1021/jm960759e
BindingDB Entry DOI: 10.7270/Q2NK3FPV
Integrase
(Human immunodeficiency virus 1)
BDBM50056922
(1,4-Dihydroxy-10-methoxy-5,8-dimethyl-3,7-dioxo-1,...)
Show SMILES COc1cc(C)c2c(Oc3c4C(O)OC(=O)c4c(O)c(C)c3OC2=O)c1C=O
Show InChI InChI=1S/C19H14O9/c1-6-4-9(25-3)8(5-20)15-10(6)17(22)27-14-7(2)13(21)11-12(16(14)26-15)19(24)28-18(11)23/h4-5,19,21,24H,1-3H3
n/an/a 1.17E+4n/an/an/an/an/an/a
National Cancer Institute
Curated by ChEMBL
Assay Description
Inhibitory concentration of compound against disintegration (reversal of strand transfer)of HIV-1 integrase
J Med Chem 40: 942-51 (1997)
Article DOI: 10.1021/jm960759e
BindingDB Entry DOI: 10.7270/Q2NK3FPV
Integrase
(Human immunodeficiency virus 1)
BDBM50056922
(1,4-Dihydroxy-10-methoxy-5,8-dimethyl-3,7-dioxo-1,...)
Show SMILES COc1cc(C)c2c(Oc3c4C(O)OC(=O)c4c(O)c(C)c3OC2=O)c1C=O
Show InChI InChI=1S/C19H14O9/c1-6-4-9(25-3)8(5-20)15-10(6)17(22)27-14-7(2)13(21)11-12(16(14)26-15)19(24)28-18(11)23/h4-5,19,21,24H,1-3H3
n/an/a 1.90E+3n/an/an/an/an/an/a
National Cancer Institute
Curated by ChEMBL
Assay Description
Inhibitory concentration of compound against strand transfer of HIV-1 integrase in experiment 2
J Med Chem 40: 942-51 (1997)
Article DOI: 10.1021/jm960759e
BindingDB Entry DOI: 10.7270/Q2NK3FPV
Integrase
(Human immunodeficiency virus 1)
BDBM50056922
(1,4-Dihydroxy-10-methoxy-5,8-dimethyl-3,7-dioxo-1,...)
Show SMILES COc1cc(C)c2c(Oc3c4C(O)OC(=O)c4c(O)c(C)c3OC2=O)c1C=O
Show InChI InChI=1S/C19H14O9/c1-6-4-9(25-3)8(5-20)15-10(6)17(22)27-14-7(2)13(21)11-12(16(14)26-15)19(24)28-18(11)23/h4-5,19,21,24H,1-3H3
n/an/a 2.90E+3n/an/an/an/an/an/a
National Cancer Institute
Curated by ChEMBL
Assay Description
Inhibitory concentration of compound against 3'-processing of HIV-1 integrase in experiment 2
J Med Chem 40: 942-51 (1997)
Article DOI: 10.1021/jm960759e
BindingDB Entry DOI: 10.7270/Q2NK3FPV
Integrase
(Human immunodeficiency virus 1)
BDBM50056922
(1,4-Dihydroxy-10-methoxy-5,8-dimethyl-3,7-dioxo-1,...)
Show SMILES COc1cc(C)c2c(Oc3c4C(O)OC(=O)c4c(O)c(C)c3OC2=O)c1C=O
Show InChI InChI=1S/C19H14O9/c1-6-4-9(25-3)8(5-20)15-10(6)17(22)27-14-7(2)13(21)11-12(16(14)26-15)19(24)28-18(11)23/h4-5,19,21,24H,1-3H3
n/an/a 2.60E+3n/an/an/an/an/an/a
National Cancer Institute
Curated by ChEMBL
Assay Description
Inhibitory concentration of compound against strand transfer of HIV-1 integrase in experiment 1
J Med Chem 40: 942-51 (1997)
Article DOI: 10.1021/jm960759e
BindingDB Entry DOI: 10.7270/Q2NK3FPV
3-hydroxyacyl-[acyl-carrier-protein] dehydratase FabZ
(Francisella tularensis)
BDBM50056922
(1,4-Dihydroxy-10-methoxy-5,8-dimethyl-3,7-dioxo-1,...)
Show SMILES COc1cc(C)c2c(Oc3c4C(O)OC(=O)c4c(O)c(C)c3OC2=O)c1C=O
Show InChI InChI=1S/C19H14O9/c1-6-4-9(25-3)8(5-20)15-10(6)17(22)27-14-7(2)13(21)11-12(16(14)26-15)19(24)28-18(11)23/h4-5,19,21,24H,1-3H3
n/an/a 2.78E+4n/an/an/an/a7.025
Brookhaven National Laboratory
Assay Description
The enzymatic activities of FtFabZ and YpFabZ were determined via the reportedspectrophotometric method using the substrate analogue crotonoyl-CoA.7 ...
Biochemistry 55: 1091-9 (2016)
Article DOI: 10.1021/acs.biochem.5b00832
BindingDB Entry DOI: 10.7270/Q2CN72P1