null
SMILES: CN1C(=O)C(C(=O)Nc2ccc(Cl)cc2)c2cc(Cl)ccc2S1(=O)=O
InChI Key: InChIKey=QWHBHJFXNTYZMY-UHFFFAOYSA-N
Activity Spreadsheet -- Enzyme Inhibition Constant Data from BindingDB
Found 2 hits for monomerid = 50056995
Trg + Lig
Ki
nM
ΔG°
kcal/mole
IC50
nM
Kd
nM
EC50/IC50
nM
koff
s-1
kon
M-1s-1
pHTemp
°C
Prostaglandin G/H synthase 2
(Homo sapiens (Human))
BDBM50056995
(6-Chloro-3-hydroxy-2-methyl-1,1-dioxo-1,2-dihydro-...)
Show SMILES CN1C(=O)C(C(=O)Nc2ccc(Cl)cc2)c2cc(Cl)ccc2S1(=O)=O
Show InChI InChI=1S/C16H12Cl2N2O4S/c1-20-16(22)14(15(21)19-11-5-2-9(17)3-6-11)12-8-10(18)4-7-13(12)25(20,23)24/h2-8,14H,1H3,(H,19,21)
NCI pathway
Reactome pathway
n/an/a 64n/an/an/an/an/an/a
Boehringer Ingelheim Pharmaceuticals
Curated by ChEMBL
Assay Description
Concentration of drug that causes a 50% decrease in the maximal inhibition of Prostaglandin G/H synthase 2 activity as measured by PGE2 production('+...
J Med Chem 40: 980-9 (1997)
Article DOI: 10.1021/jm9607010
BindingDB Entry DOI: 10.7270/Q2WH2P37
Prostaglandin G/H synthase 1
(Homo sapiens (Human))
BDBM50056995
(6-Chloro-3-hydroxy-2-methyl-1,1-dioxo-1,2-dihydro-...)
Show SMILES CN1C(=O)C(C(=O)Nc2ccc(Cl)cc2)c2cc(Cl)ccc2S1(=O)=O
Show InChI InChI=1S/C16H12Cl2N2O4S/c1-20-16(22)14(15(21)19-11-5-2-9(17)3-6-11)12-8-10(18)4-7-13(12)25(20,23)24/h2-8,14H,1H3,(H,19,21)
n/an/a 390n/an/an/an/an/an/a
Boehringer Ingelheim Pharmaceuticals
Curated by ChEMBL
Assay Description
Concentration of drug that causes a 50% decrease in the maximal inhibition of Prostaglandin G/H synthase 1 activity as measured by PGE2 production('+...
J Med Chem 40: 980-9 (1997)
Article DOI: 10.1021/jm9607010
BindingDB Entry DOI: 10.7270/Q2WH2P37