BDBM50057164 CHEMBL10862::Sodium; (Z)-2-(7-methoxy-benzo[1,3]dioxol-5-yl)-4-(4-methoxy-phenyl)-4-oxo-3-(2,3,4-trimethoxy-benzyl)-but-2-enoate
SMILES: COc1ccc(cc1)C(=O)C(\Cc1ccc(OC)c(OC)c1OC)=C(/C([O-])=O)c1cc2OCOc2c(OC)c1
InChI Key: InChIKey=DYQYSMVRLLQKSO-GFMRDNFCSA-M
Data: 2 IC50
Activity Spreadsheet -- Enzyme Inhibition Constant Data from BindingDB
Found 2 hits for monomerid = 50057164
Trg + Lig
Ki
nM
ΔG°
kcal/mole
IC50
nM
Kd
nM
EC50/IC50
nM
koff
s-1
kon
M-1s-1
pHTemp
°C
Endothelin-1 receptor
(Homo sapiens (Human))
BDBM50057164
(CHEMBL10862 | Sodium; (Z)-2-(7-methoxy-benzo[1,3]d...)
Show SMILES COc1ccc(cc1)C(=O)C(\Cc1ccc(OC)c(OC)c1OC)=C(/C([O-])=O)c1cc2OCOc2c(OC)c1
Show InChI InChI=1S/C29H28O10/c1-33-19-9-6-16(7-10-19)25(30)20(12-17-8-11-21(34-2)28(37-5)26(17)36-4)24(29(31)32)18-13-22(35-3)27-23(14-18)38-15-39-27/h6-11,13-14H,12,15H2,1-5H3,(H,31,32)/p-1/b24-20-
n/an/a 0.340n/an/an/an/an/an/a
Warner-Lambert Company
Curated by ChEMBL
Assay Description
Inhibition of Endothelin A receptor mediated (ET-1) release of arachidonic acid from rabbit renal artery vascular smooth muscle cells
J Med Chem 40: 1063-74 (1997)
Article DOI: 10.1021/jm9606507
BindingDB Entry DOI: 10.7270/Q27P8XG5
EDNRB
(Homo sapiens (Human))
BDBM50057164
(CHEMBL10862 | Sodium; (Z)-2-(7-methoxy-benzo[1,3]d...)
Show SMILES COc1ccc(cc1)C(=O)C(\Cc1ccc(OC)c(OC)c1OC)=C(/C([O-])=O)c1cc2OCOc2c(OC)c1
Show InChI InChI=1S/C29H28O10/c1-33-19-9-6-16(7-10-19)25(30)20(12-17-8-11-21(34-2)28(37-5)26(17)36-4)24(29(31)32)18-13-22(35-3)27-23(14-18)38-15-39-27/h6-11,13-14H,12,15H2,1-5H3,(H,31,32)/p-1/b24-20-
n/an/a 5.10E+3n/an/an/an/an/an/a
Warner-Lambert Company
Curated by ChEMBL
Assay Description
Inhibition of Endothelin B receptor mediated (ET-3) release of arachidonic acid from human cloned receptors expressed in CHO-K1 cells
J Med Chem 40: 1063-74 (1997)
Article DOI: 10.1021/jm9606507
BindingDB Entry DOI: 10.7270/Q27P8XG5