BDBM50057194 3-Benzo[1,3]dioxol-5-yl-4-(2,5-dimethoxy-benzyl)-5-hydroxy-5-(4-methoxy-phenyl)-5H-furan-2-one::CHEMBL273723
SMILES: COc1ccc(cc1)C1(O)OC(=O)C(=C1Cc1cc(OC)ccc1OC)c1ccc2OCOc2c1
InChI Key: InChIKey=CROFEMTXJUXGTE-UHFFFAOYSA-N
Data: 2 IC50
Activity Spreadsheet -- Enzyme Inhibition Constant Data from BindingDB
Found 2 hits for monomerid = 50057194
Trg + Lig
Ki
nM
ΔG°
kcal/mole
IC50
nM
Kd
nM
EC50/IC50
nM
koff
s-1
kon
M-1s-1
pHTemp
°C
Endothelin-1 receptor
(Homo sapiens (Human))
BDBM50057194
(3-Benzo[1,3]dioxol-5-yl-4-(2,5-dimethoxy-benzyl)-5...)
Show SMILES COc1ccc(cc1)C1(O)OC(=O)C(=C1Cc1cc(OC)ccc1OC)c1ccc2OCOc2c1 |c:14|
Show InChI InChI=1S/C27H24O8/c1-30-19-7-5-18(6-8-19)27(29)21(13-17-12-20(31-2)9-11-22(17)32-3)25(26(28)35-27)16-4-10-23-24(14-16)34-15-33-23/h4-12,14,29H,13,15H2,1-3H3
n/an/a 2.10n/an/an/an/an/an/a
Warner-Lambert Company
Curated by ChEMBL
Assay Description
Binding affinity against human cloned endothelin A receptor expressed in LTK-cells
J Med Chem 40: 1063-74 (1997)
Article DOI: 10.1021/jm9606507
BindingDB Entry DOI: 10.7270/Q27P8XG5
EDNRB
(Homo sapiens (Human))
BDBM50057194
(3-Benzo[1,3]dioxol-5-yl-4-(2,5-dimethoxy-benzyl)-5...)
Show SMILES COc1ccc(cc1)C1(O)OC(=O)C(=C1Cc1cc(OC)ccc1OC)c1ccc2OCOc2c1 |c:14|
Show InChI InChI=1S/C27H24O8/c1-30-19-7-5-18(6-8-19)27(29)21(13-17-12-20(31-2)9-11-22(17)32-3)25(26(28)35-27)16-4-10-23-24(14-16)34-15-33-23/h4-12,14,29H,13,15H2,1-3H3
n/an/a 1.00E+3n/an/an/an/an/an/a
Warner-Lambert Company
Curated by ChEMBL
Assay Description
Binding affinity against human cloned Endothelin B receptor expressed in CHO-K1 cells
J Med Chem 40: 1063-74 (1997)
Article DOI: 10.1021/jm9606507
BindingDB Entry DOI: 10.7270/Q27P8XG5