BDBM50057279 CHEMBL3322632
SMILES: CCOC(=O)N1CCN(CC1)C(=O)[C@H](CCC(O)=O)NC(=O)c1cc(nc(n1)-c1ccccc1)-c1ccsc1
InChI Key: InChIKey=MZJBTSWSBMERIZ-FQEVSTJZSA-N
Data: 1 IC50
Activity Spreadsheet -- Enzyme Inhibition Constant Data from BindingDB
Found 1 hit for monomerid = 50057279
Trg + Lig
Ki
nM
ΔG°
kcal/mole
IC50
nM
Kd
nM
EC50/IC50
nM
koff
s-1
kon
M-1s-1
pHTemp
°C
Purinergic receptor P2Y12
(Homo sapiens (Human))
BDBM50057279
(CHEMBL3322632)
Show SMILES CCOC(=O)N1CCN(CC1)C(=O)[C@H](CCC(O)=O)NC(=O)c1cc(nc(n1)-c1ccccc1)-c1ccsc1 |r|
Show InChI InChI=1S/C27H29N5O6S/c1-2-38-27(37)32-13-11-31(12-14-32)26(36)20(8-9-23(33)34)30-25(35)22-16-21(19-10-15-39-17-19)28-24(29-22)18-6-4-3-5-7-18/h3-7,10,15-17,20H,2,8-9,11-14H2,1H3,(H,30,35)(H,33,34)/t20-/m0/s1
Reactome pathway
n/an/a 11n/an/an/an/an/an/a
Actelion Pharmaceuticals Ltd
Curated by ChEMBL
Assay Description
Displacement of [3H]-2-methyl-thio-adenosine 5'-diphosphate from human recombinant P2Y12 expressed in CHO cell membranes by scintillation counting me...
Bioorg Med Chem Lett 24: 4323-31 (2014)
Article DOI: 10.1016/j.bmcl.2014.06.070
BindingDB Entry DOI: 10.7270/Q28C9XW4