BDBM50057374 CHEMBL3322759
SMILES: COc1ccc-2c(NC3(CCN(CC3)C(=O)c3cccc(Cl)c3)c3cccn-23)c1
InChI Key: InChIKey=YPHWAPBSPXUFOR-UHFFFAOYSA-N
Data: 2 IC50
Activity Spreadsheet -- Enzyme Inhibition Constant Data from BindingDB
Found 2 hits for monomerid = 50057374
Trg + Lig
Ki
nM
ΔG°
kcal/mole
IC50
nM
Kd
nM
EC50/IC50
nM
koff
s-1
kon
M-1s-1
pHTemp
°C
Sodium channel protein type 5 subunit alpha
(Homo sapiens (Human))
BDBM50057374
(CHEMBL3322759)
Show SMILES COc1ccc-2c(NC3(CCN(CC3)C(=O)c3cccc(Cl)c3)c3cccn-23)c1
Show InChI InChI=1S/C23H22ClN3O2/c1-29-18-7-8-20-19(15-18)25-23(21-6-3-11-27(20)21)9-12-26(13-10-23)22(28)16-4-2-5-17(24)14-16/h2-8,11,14-15,25H,9-10,12-13H2,1H3
n/an/a 4.42E+3n/an/an/an/an/an/a
Merck Research Laboratory
Curated by ChEMBL
Assay Description
Inhibition of human Nav1.5 channel expressed in HEK293 cells assessed as membrane potential after 60 mins by FLIPR assay
Bioorg Med Chem Lett 24: 4110-3 (2014)
Article DOI: 10.1016/j.bmcl.2014.07.060
BindingDB Entry DOI: 10.7270/Q24M9656
Sodium channel protein type 9 subunit alpha
(Homo sapiens (Human))
BDBM50057374
(CHEMBL3322759)
Show SMILES COc1ccc-2c(NC3(CCN(CC3)C(=O)c3cccc(Cl)c3)c3cccn-23)c1
Show InChI InChI=1S/C23H22ClN3O2/c1-29-18-7-8-20-19(15-18)25-23(21-6-3-11-27(20)21)9-12-26(13-10-23)22(28)16-4-2-5-17(24)14-16/h2-8,11,14-15,25H,9-10,12-13H2,1H3
n/an/a 48n/an/an/an/an/an/a
Merck Research Laboratory
Curated by ChEMBL
Assay Description
Inhibition of human Nav1.7 channel expressed in HEK293 cells assessed as membrane potential after 60 mins by FLIPR assay
Bioorg Med Chem Lett 24: 4110-3 (2014)
Article DOI: 10.1016/j.bmcl.2014.07.060
BindingDB Entry DOI: 10.7270/Q24M9656