null
SMILES: NS(=O)(=O)c1ccc(cc1)-c1cc(nn1-c1ccc(F)cc1)C(F)(F)F
InChI Key: InChIKey=BBOGYKPAKFQZFU-UHFFFAOYSA-N
Activity Spreadsheet -- Enzyme Inhibition Constant Data from BindingDB
Found 3 hits for monomerid = 50057602
Trg + Lig
Ki
nM
ΔG°
kcal/mole
IC50
nM
Kd
nM
EC50/IC50
nM
koff
s-1
kon
M-1s-1
pHTemp
°C
Prostaglandin G/H synthase 1
(Homo sapiens (Human))
BDBM50057602
(4-[2-(4-Fluoro-phenyl)-5-trifluoromethyl-2H-pyrazo...)
Show SMILES NS(=O)(=O)c1ccc(cc1)-c1cc(nn1-c1ccc(F)cc1)C(F)(F)F
Show InChI InChI=1S/C16H11F4N3O2S/c17-11-3-5-12(6-4-11)23-14(9-15(22-23)16(18,19)20)10-1-7-13(8-2-10)26(21,24)25/h1-9H,(H2,21,24,25)
n/an/a 80n/an/an/an/an/an/a
Searle Research and Development
Curated by ChEMBL
Assay Description
In vitro inhibitory concentration required to block recombinant human prostaglandin G/H synthase 1 (COX-1)
J Med Chem 40: 1347-65 (1997)
Article DOI: 10.1021/jm960803q
BindingDB Entry DOI: 10.7270/Q2Z89BHB
Prostaglandin G/H synthase 2
(Homo sapiens (Human))
BDBM50057602
(4-[2-(4-Fluoro-phenyl)-5-trifluoromethyl-2H-pyrazo...)
Show SMILES NS(=O)(=O)c1ccc(cc1)-c1cc(nn1-c1ccc(F)cc1)C(F)(F)F
Show InChI InChI=1S/C16H11F4N3O2S/c17-11-3-5-12(6-4-11)23-14(9-15(22-23)16(18,19)20)10-1-7-13(8-2-10)26(21,24)25/h1-9H,(H2,21,24,25)
NCI pathway
Reactome pathway
n/an/a 10n/an/an/an/an/an/a
Universit£ de Lille 2
Curated by ChEMBL
Assay Description
Inhibition of human Prostaglandin G/H synthase 2
J Med Chem 44: 3223-30 (2001)
BindingDB Entry DOI: 10.7270/Q2736S4D
Prostaglandin G/H synthase 2
(Homo sapiens (Human))
BDBM50057602
(4-[2-(4-Fluoro-phenyl)-5-trifluoromethyl-2H-pyrazo...)
Show SMILES NS(=O)(=O)c1ccc(cc1)-c1cc(nn1-c1ccc(F)cc1)C(F)(F)F
Show InChI InChI=1S/C16H11F4N3O2S/c17-11-3-5-12(6-4-11)23-14(9-15(22-23)16(18,19)20)10-1-7-13(8-2-10)26(21,24)25/h1-9H,(H2,21,24,25)
NCI pathway
Reactome pathway
n/an/a 10n/an/an/an/an/an/a
Searle Research and Development
Curated by ChEMBL
Assay Description
In vitro inhibitory concentration required to block human recombinant prostaglandin G/H synthase 2 (COX-2)
J Med Chem 40: 1347-65 (1997)
Article DOI: 10.1021/jm960803q
BindingDB Entry DOI: 10.7270/Q2Z89BHB