BDBM50057610 4-[5-(4-Chloro-phenyl)-3-difluoromethyl-pyrazol-1-yl]-benzenesulfonamide::CHEMBL433428
SMILES: NS(=O)(=O)c1ccc(cc1)-n1nc(cc1-c1ccc(Cl)cc1)C(F)F
InChI Key: InChIKey=JDCWOBTUQSMXDU-UHFFFAOYSA-N
Data: 3 IC50
Activity Spreadsheet -- Enzyme Inhibition Constant Data from BindingDB
Found 3 hits for monomerid = 50057610
Trg + Lig
Ki
nM
ΔG°
kcal/mole
IC50
nM
Kd
nM
EC50/IC50
nM
koff
s-1
kon
M-1s-1
pHTemp
°C
Cyclooxygenase-1 (COX-1)
(Homo sapiens (Human))
BDBM50057610
(4-[5-(4-Chloro-phenyl)-3-difluoromethyl-pyrazol-1-...)
Show SMILES NS(=O)(=O)c1ccc(cc1)-n1nc(cc1-c1ccc(Cl)cc1)C(F)F
Show InChI InChI=1S/C16H12ClF2N3O2S/c17-11-3-1-10(2-4-11)15-9-14(16(18)19)21-22(15)12-5-7-13(8-6-12)25(20,23)24/h1-9,16H,(H2,20,23,24)
n/an/a 5.70E+3n/an/an/an/an/an/a
Searle Research and Development
Curated by ChEMBL
Assay Description
In vitro inhibitory concentration required to block recombinant human prostaglandin G/H synthase 1 (COX-1)
J Med Chem 40: 1347-65 (1997)
Article DOI: 10.1021/jm960803q
BindingDB Entry DOI: 10.7270/Q2Z89BHB
Cyclooxygenase
(Homo sapiens (Human))
BDBM50057610
(4-[5-(4-Chloro-phenyl)-3-difluoromethyl-pyrazol-1-...)
Show SMILES NS(=O)(=O)c1ccc(cc1)-n1nc(cc1-c1ccc(Cl)cc1)C(F)F
Show InChI InChI=1S/C16H12ClF2N3O2S/c17-11-3-1-10(2-4-11)15-9-14(16(18)19)21-22(15)12-5-7-13(8-6-12)25(20,23)24/h1-9,16H,(H2,20,23,24)
NCI pathway
Reactome pathway
n/an/a 10n/an/an/an/an/an/a
Universit£ de Lille 2
Curated by ChEMBL
Assay Description
Inhibition of human Prostaglandin G/H synthase 2
J Med Chem 44: 3223-30 (2001)
BindingDB Entry DOI: 10.7270/Q2736S4D
Cyclooxygenase
(Homo sapiens (Human))
BDBM50057610
(4-[5-(4-Chloro-phenyl)-3-difluoromethyl-pyrazol-1-...)
Show SMILES NS(=O)(=O)c1ccc(cc1)-n1nc(cc1-c1ccc(Cl)cc1)C(F)F
Show InChI InChI=1S/C16H12ClF2N3O2S/c17-11-3-1-10(2-4-11)15-9-14(16(18)19)21-22(15)12-5-7-13(8-6-12)25(20,23)24/h1-9,16H,(H2,20,23,24)
NCI pathway
Reactome pathway
n/an/a 10n/an/an/an/an/an/a
Searle Research and Development
Curated by ChEMBL
Assay Description
In vitro inhibitory concentration required to block human recombinant prostaglandin G/H synthase 2 (COX-2)
J Med Chem 40: 1347-65 (1997)
Article DOI: 10.1021/jm960803q
BindingDB Entry DOI: 10.7270/Q2Z89BHB