BDBM50057661 CHEMBL3322842
SMILES: [O-][N+](=O)c1ccc(Oc2ccc(cc2)-c2nnc(NC(=O)c3cccnc3)s2)cc1
InChI Key: InChIKey=GGQUYIVNRPCMGS-UHFFFAOYSA-N
Data: 2 IC50
Activity Spreadsheet -- Enzyme Inhibition Constant Data from BindingDB
Found 2 hits for monomerid = 50057661
Trg + Lig
Ki
nM
ΔG°
kcal/mole
IC50
nM
Kd
nM
EC50/IC50
nM
koff
s-1
kon
M-1s-1
pHTemp
°C
Protein-tyrosine phosphatase 1B
(Homo sapiens (Human))
BDBM50057661
(CHEMBL3322842)
Show SMILES [O-][N+](=O)c1ccc(Oc2ccc(cc2)-c2nnc(NC(=O)c3cccnc3)s2)cc1
Show InChI InChI=1S/C20H13N5O4S/c26-18(14-2-1-11-21-12-14)22-20-24-23-19(30-20)13-3-7-16(8-4-13)29-17-9-5-15(6-10-17)25(27)28/h1-12H,(H,22,24,26)
NCI pathway
Reactome pathway
n/an/a 4.20n/an/an/an/an/an/a
Liaoning Normal University
Curated by ChEMBL
Assay Description
Inhibition of PTP1B (unknown origin)
Bioorg Med Chem Lett 24: 4125-8 (2014)
Article DOI: 10.1016/j.bmcl.2014.07.055
BindingDB Entry DOI: 10.7270/Q2MP54XR
Dual specificity phosphatase Cdc25B
(Homo sapiens (Human))
BDBM50057661
(CHEMBL3322842)
Show SMILES [O-][N+](=O)c1ccc(Oc2ccc(cc2)-c2nnc(NC(=O)c3cccnc3)s2)cc1
Show InChI InChI=1S/C20H13N5O4S/c26-18(14-2-1-11-21-12-14)22-20-24-23-19(30-20)13-3-7-16(8-4-13)29-17-9-5-15(6-10-17)25(27)28/h1-12H,(H,22,24,26)
Reactome pathway
n/an/a 3.40n/an/an/an/an/an/a
Liaoning Normal University
Curated by ChEMBL
Assay Description
Inhibition of Cdc25B (unknown origin)
Bioorg Med Chem Lett 24: 4125-8 (2014)
Article DOI: 10.1016/j.bmcl.2014.07.055
BindingDB Entry DOI: 10.7270/Q2MP54XR