BDBM50057664 CHEMBL3322846
SMILES: Cc1ccc(cc1)C(=O)Nc1nnc(s1)-c1ccc(Oc2ccc(cc2[N+]([O-])=O)[N+]([O-])=O)cc1
InChI Key: InChIKey=FDRDCFFBIUUJMW-UHFFFAOYSA-N
Data: 2 IC50
Activity Spreadsheet -- Enzyme Inhibition Constant Data from BindingDB
Found 2 hits for monomerid = 50057664
Trg + Lig
Ki
nM
ΔG°
kcal/mole
IC50
nM
Kd
nM
EC50/IC50
nM
koff
s-1
kon
M-1s-1
pHTemp
°C
Protein-tyrosine phosphatase 1B
(Homo sapiens (Human))
BDBM50057664
(CHEMBL3322846)
Show SMILES Cc1ccc(cc1)C(=O)Nc1nnc(s1)-c1ccc(Oc2ccc(cc2[N+]([O-])=O)[N+]([O-])=O)cc1
Show InChI InChI=1S/C22H15N5O6S/c1-13-2-4-14(5-3-13)20(28)23-22-25-24-21(34-22)15-6-9-17(10-7-15)33-19-11-8-16(26(29)30)12-18(19)27(31)32/h2-12H,1H3,(H,23,25,28)
NCI pathway
Reactome pathway
n/an/a 5.10n/an/an/an/an/an/a
Liaoning Normal University
Curated by ChEMBL
Assay Description
Inhibition of PTP1B (unknown origin)
Bioorg Med Chem Lett 24: 4125-8 (2014)
Article DOI: 10.1016/j.bmcl.2014.07.055
BindingDB Entry DOI: 10.7270/Q2MP54XR
Dual specificity phosphatase Cdc25B
(Homo sapiens (Human))
BDBM50057664
(CHEMBL3322846)
Show SMILES Cc1ccc(cc1)C(=O)Nc1nnc(s1)-c1ccc(Oc2ccc(cc2[N+]([O-])=O)[N+]([O-])=O)cc1
Show InChI InChI=1S/C22H15N5O6S/c1-13-2-4-14(5-3-13)20(28)23-22-25-24-21(34-22)15-6-9-17(10-7-15)33-19-11-8-16(26(29)30)12-18(19)27(31)32/h2-12H,1H3,(H,23,25,28)
Reactome pathway
n/an/a 1.20n/an/an/an/an/an/a
Liaoning Normal University
Curated by ChEMBL
Assay Description
Inhibition of Cdc25B (unknown origin)
Bioorg Med Chem Lett 24: 4125-8 (2014)
Article DOI: 10.1016/j.bmcl.2014.07.055
BindingDB Entry DOI: 10.7270/Q2MP54XR