null
SMILES: COc1ccc(\C=N\N2CC(C)OC(C)C2)cc1OC1CCCC1
InChI Key: InChIKey=NDQMTNKRDQKQQZ-RGVLZGJSSA-N
Activity Spreadsheet -- Enzyme Inhibition Constant Data from BindingDB
Found 1 hit for monomerid = 50057792
Trg + Lig
Ki
nM
ΔG°
kcal/mole
IC50
nM
Kd
nM
EC50/IC50
nM
koff
s-1
kon
M-1s-1
pHTemp
°C
cAMP-specific 3',5'-cyclic phosphodiesterase 4D
(Homo sapiens (Human))
BDBM50057792
(CHEMBL3326084)
Show SMILES COc1ccc(\C=N\N2CC(C)OC(C)C2)cc1OC1CCCC1
Show InChI InChI=1S/C19H28N2O3/c1-14-12-21(13-15(2)23-14)20-11-16-8-9-18(22-3)19(10-16)24-17-6-4-5-7-17/h8-11,14-15,17H,4-7,12-13H2,1-3H3/b20-11+
n/an/a 1.55E+3n/an/an/an/an/an/a
University of Genoa
Curated by ChEMBL
Assay Description
Inhibition of recombinant human PDE4D3 expressed in baculoviral system
J Med Chem 57: 7061-72 (2014)
Article DOI: 10.1021/jm500855w
BindingDB Entry DOI: 10.7270/Q23N251C