BDBM50057811 1-(4-Azido-5-hydroxymethyl-tetrahydro-furan-2-yl)-3-(6-hydroxy-hexyl)-5-methyl-1H-pyrimidine-2,4-dione::CHEMBL43028
SMILES: Cc1cn(C2CC(N=[N+]=[N-])C(CO)O2)c(=O)n(CCCCCCO)c1=O
InChI Key: InChIKey=OGSINDHYTFRHAI-UHFFFAOYSA-N
Data: 1 EC50
Activity Spreadsheet -- Enzyme Inhibition Constant Data from BindingDB
Found 1 hit for monomerid = 50057811
Trg + Lig
Ki
nM
ΔG°
kcal/mole
IC50
nM
Kd
nM
EC50/IC50
nM
koff
s-1
kon
M-1s-1
pHTemp
°C
Human immunodeficiency virus type 1 reverse transcriptase
(Human immunodeficiency virus 1)
BDBM50057811
(1-(4-Azido-5-hydroxymethyl-tetrahydro-furan-2-yl)-...)
Show SMILES Cc1cn(C2CC(N=[N+]=[N-])C(CO)O2)c(=O)n(CCCCCCO)c1=O
Show InChI InChI=1S/C16H25N5O5/c1-11-9-21(14-8-12(18-19-17)13(10-23)26-14)16(25)20(15(11)24)6-4-2-3-5-7-22/h9,12-14,22-23H,2-8,10H2,1H3
n/an/an/an/a 1.20E+3n/an/an/an/a
Institut de Chimie des Substances Naturelles CNRS
Curated by ChEMBL
Assay Description
Reverse transcriptase activity was measured in the culture supernatant, concentration that reduces by 50% the HIV produced in the supernatant.
J Med Chem 40: 1550-8 (1997)
Article DOI: 10.1021/jm9600095
BindingDB Entry DOI: 10.7270/Q2TH8KSM