null
SMILES: Oc1ccc(cc1C(F)(F)F)C(=O)NNC(=O)c1occ(c1-c1ccccc1)-c1ccccc1
InChI Key: InChIKey=YFKJFXJIVQHGHP-UHFFFAOYSA-N
Activity Spreadsheet -- Enzyme Inhibition Constant Data from BindingDB
Found 1 hit for monomerid = 50057820
Trg + Lig
Ki
nM
ΔG°
kcal/mole
IC50
nM
Kd
nM
EC50/IC50
nM
koff
s-1
kon
M-1s-1
pHTemp
°C
Glucagon receptor
(Rattus norvegicus)
BDBM50057820
(CHEMBL3326174)
Show SMILES Oc1ccc(cc1C(F)(F)F)C(=O)NNC(=O)c1occ(c1-c1ccccc1)-c1ccccc1
Show InChI InChI=1S/C25H17F3N2O4/c26-25(27,28)19-13-17(11-12-20(19)31)23(32)29-30-24(33)22-21(16-9-5-2-6-10-16)18(14-34-22)15-7-3-1-4-8-15/h1-14,31H,(H,29,32)(H,30,33)
Reactome pathway
n/an/a 160n/an/an/an/an/an/a
Dainippon Sumitomo Pharma. Co. Ltd
Curated by ChEMBL
Assay Description
Displacement of [125I]glucagon from glucagon receptor in rat hepatocyte membranes after 30 mins by gamma-counting
Bioorg Med Chem Lett 24: 4266-70 (2014)
Article DOI: 10.1016/j.bmcl.2014.07.025
BindingDB Entry DOI: 10.7270/Q2ZW1NK4