BDBM50057843 (5aS,11bR)-4,5,5a,6,7,11b-Hexahydro-3-thia-5-aza-cyclopenta[c]phenanthrene-9,10-diol::CHEMBL40950
SMILES: Oc1cc2CC[C@@H]3NCc4sccc4[C@H]3c2cc1O
InChI Key: InChIKey=UUGICWXWTLQAGO-NHYWBVRUSA-N
Data: 2 KI  1 EC50
Activity Spreadsheet -- Enzyme Inhibition Constant Data from BindingDB
Found 3 hits for monomerid = 50057843
Trg + Lig
Ki
nM
ΔG°
kcal/mole
IC50
nM
Kd
nM
EC50/IC50
nM
koff
s-1
kon
M-1s-1
pHTemp
°C
D(1A) dopamine receptor
(RAT)
BDBM50057843
((5aS,11bR)-4,5,5a,6,7,11b-Hexahydro-3-thia-5-aza-c...)
Show SMILES Oc1cc2CC[C@@H]3NCc4sccc4[C@H]3c2cc1O
Show InChI InChI=1S/C15H15NO2S/c17-12-5-8-1-2-11-15(10(8)6-13(12)18)9-3-4-19-14(9)7-16-11/h3-6,11,15-18H,1-2,7H2/t11-,15-/m0/s1
73n/an/an/an/an/an/an/an/a
Abbott Laboratories
Curated by ChEMBL
Assay Description
In vitro binding affinity against Dopamine receptor D1 like from rat caudate membrane using [125I]-SCH as radioligand
J Med Chem 40: 1585-99 (1997)
Article DOI: 10.1021/jm970038v
BindingDB Entry DOI: 10.7270/Q2Z89D2B
D(2) dopamine receptor
(Rattus norvegicus (rat))
BDBM50057843
((5aS,11bR)-4,5,5a,6,7,11b-Hexahydro-3-thia-5-aza-c...)
Show SMILES Oc1cc2CC[C@@H]3NCc4sccc4[C@H]3c2cc1O
Show InChI InChI=1S/C15H15NO2S/c17-12-5-8-1-2-11-15(10(8)6-13(12)18)9-3-4-19-14(9)7-16-11/h3-6,11,15-18H,1-2,7H2/t11-,15-/m0/s1
Reactome pathway
1.29E+3n/an/an/an/an/an/an/an/a
Abbott Laboratories
Curated by ChEMBL
Assay Description
In vitro binding affinity against Dopamine receptor D2 like from rat caudate membrane using [3H]-spiperone as radioligand
J Med Chem 40: 1585-99 (1997)
Article DOI: 10.1021/jm970038v
BindingDB Entry DOI: 10.7270/Q2Z89D2B
Dopamine D1 receptor
(Carassius auratus)
BDBM50057843
((5aS,11bR)-4,5,5a,6,7,11b-Hexahydro-3-thia-5-aza-c...)
Show SMILES Oc1cc2CC[C@@H]3NCc4sccc4[C@H]3c2cc1O
Show InChI InChI=1S/C15H15NO2S/c17-12-5-8-1-2-11-15(10(8)6-13(12)18)9-3-4-19-14(9)7-16-11/h3-6,11,15-18H,1-2,7H2/t11-,15-/m0/s1
Reactome pathway
n/an/an/an/a 47n/an/an/an/a
Abbott Laboratories
Curated by ChEMBL
Assay Description
Ability to stimulate the Dopamine receptor D1 like was assayed by measuring cAMP production in cell free homogenates of goldfish retinal tissue
J Med Chem 40: 1585-99 (1997)
Article DOI: 10.1021/jm970038v
BindingDB Entry DOI: 10.7270/Q2Z89D2B